BDBM29912 substituted 6-aminoquinoline-3-carbonitrile, 23
SMILES: Fc1ccc(Nc2c(cnc3c(Cl)cc(NCc4cn(nn4)-c4ccncc4)cc23)C#N)cc1Cl
InChI Key: InChIKey=JTDOQBLJBRUSEZ-UHFFFAOYSA-N
Data: 1 IC50
Activity Spreadsheet -- Enzyme Inhibition Constant Data from BindingDB
Found 1 hit for monomerid = 29912
Trg + Lig
Ki
nM
ΔG°
kcal/mole
IC50
nM
Kd
nM
EC50/IC50
nM
koff
s-1
kon
M-1s-1
pHTemp
°C
Mitogen-activated protein kinase kinase kinase 8
(Homo sapiens (Human))
BDBM29912
(substituted 6-aminoquinoline-3-carbonitrile, 23)
Show SMILES Fc1ccc(Nc2c(cnc3c(Cl)cc(NCc4cn(nn4)-c4ccncc4)cc23)C#N)cc1Cl
Show InChI InChI=1S/C24H15Cl2FN8/c25-20-8-15(1-2-22(20)27)32-23-14(10-28)11-31-24-19(23)7-16(9-21(24)26)30-12-17-13-35(34-33-17)18-3-5-29-6-4-18/h1-9,11,13,30H,12H2,(H,31,32)
NCI pathway
Reactome pathway
n/an/a 3n/an/an/an/a7.230
Wyeth Research
Assay Description
Tpl2/Cot activity was directly assayed using GST-MEK1 as a substrate. The phosphorylation on serine residues 217 and 221 of GST-MEK1 was detected by ...
Bioorg Med Chem Lett 19: 3485-8 (2009)
Article DOI: 10.1016/j.bmcl.2009.05.009
BindingDB Entry DOI: 10.7270/Q2HT2MN8