BDBM29915 substituted 6-aminoquinoline-3-carbonitrile, 26
SMILES: CN(C)CCn1cc(CNc2cc(Cl)c3ncc(C#N)c(Nc4ccc(F)c(Cl)c4)c3c2)nn1
InChI Key: InChIKey=HFVHWFLQYARJNQ-UHFFFAOYSA-N
Data: 1 IC50
Activity Spreadsheet -- Enzyme Inhibition Constant Data from BindingDB
Found 1 hit for monomerid = 29915
Trg + Lig
Ki
nM
ΔG°
kcal/mole
IC50
nM
Kd
nM
EC50/IC50
nM
koff
s-1
kon
M-1s-1
pHTemp
°C
Mitogen-activated protein kinase kinase kinase 8
(Homo sapiens (Human))
BDBM29915
(substituted 6-aminoquinoline-3-carbonitrile, 26)
Show SMILES CN(C)CCn1cc(CNc2cc(Cl)c3ncc(C#N)c(Nc4ccc(F)c(Cl)c4)c3c2)nn1
Show InChI InChI=1S/C23H21Cl2FN8/c1-33(2)5-6-34-13-17(31-32-34)12-28-16-7-18-22(30-15-3-4-21(26)19(24)8-15)14(10-27)11-29-23(18)20(25)9-16/h3-4,7-9,11,13,28H,5-6,12H2,1-2H3,(H,29,30)
NCI pathway
Reactome pathway
n/an/a 13n/an/an/an/a7.230
Wyeth Research
Assay Description
Tpl2/Cot activity was directly assayed using GST-MEK1 as a substrate. The phosphorylation on serine residues 217 and 221 of GST-MEK1 was detected by ...
Bioorg Med Chem Lett 19: 3485-8 (2009)
Article DOI: 10.1016/j.bmcl.2009.05.009
BindingDB Entry DOI: 10.7270/Q2HT2MN8