BDBM299384 6-(5-chloro-2- methyl-phenyl) quinazolin- 4-amine::US9592235, Example 182::US9855269, Compound 26
SMILES: Cc1ccc(Cl)cc1-c1ccc2ncnc(N)c2c1
InChI Key: InChIKey=UOOIHHNFTZZBJW-UHFFFAOYSA-N
Data: 2 IC50
Activity Spreadsheet -- Enzyme Inhibition Constant Data from BindingDB
Found 2 hits for monomerid = 299384
Trg + Lig
Ki
nM
ΔG°
kcal/mole
IC50
nM
Kd
nM
EC50/IC50
nM
koff
s-1
kon
M-1s-1
pHTemp
°C
Mitogen-activated protein kinase kinase kinase kinase 4
(Homo sapiens (Human))
BDBM299384
(6-(5-chloro-2- methyl-phenyl) quinazolin- 4-amine ...)
Show SMILES Cc1ccc(Cl)cc1-c1ccc2ncnc(N)c2c1
Show InChI InChI=1S/C15H12ClN3/c1-9-2-4-11(16)7-12(9)10-3-5-14-13(6-10)15(17)19-8-18-14/h2-8H,1H3,(H2,17,18,19)
NCI pathway
Reactome pathway
US Patent
n/an/a 90.5n/an/an/an/an/an/a
Merck Frosst Centre for Therapeutic Research
Assay Description
The kinase activity of purified human MAP4K4 kinase domain was measured by monitoring the phosphorylation of a peptide substrate derived from moesin ...
J Med Chem 46: 3709-27 (2003)
BindingDB Entry DOI: 10.7270/Q2VH5R4B
Mitogen-activated protein kinase kinase kinase kinase 4
(Homo sapiens (Human))
BDBM299384
(6-(5-chloro-2- methyl-phenyl) quinazolin- 4-amine ...)
Show SMILES Cc1ccc(Cl)cc1-c1ccc2ncnc(N)c2c1
Show InChI InChI=1S/C15H12ClN3/c1-9-2-4-11(16)7-12(9)10-3-5-14-13(6-10)15(17)19-8-18-14/h2-8H,1H3,(H2,17,18,19)
NCI pathway
Reactome pathway
US Patent
n/an/a 90.5n/an/an/an/an/an/a
Genentech, Inc.
US Patent
Assay Description
The kinase activity of purified human MAP4K4 kinase domain was measured by monitoring the phosphorylation of a peptide substrate derived from moesin ...
US Patent US9592235 (2017)
BindingDB Entry DOI: 10.7270/Q2VX0JKX