BDBM299536 6-(2-ethyl-4- pyridyl)pyrido [3,2-d]pyrimidin- 4-amine::US9592235, Example 306::US9855269, Compound 155
SMILES: CCc1cc(ccn1)-c1ccc2ncnc(N)c2n1
InChI Key: InChIKey=XPQOIYWFWXLJJR-UHFFFAOYSA-N
Data: 2 IC50
Activity Spreadsheet -- Enzyme Inhibition Constant Data from BindingDB
Found 2 hits for monomerid = 299536
Trg + Lig
Ki
nM
ΔG°
kcal/mole
IC50
nM
Kd
nM
EC50/IC50
nM
koff
s-1
kon
M-1s-1
pHTemp
°C
Mitogen-activated protein kinase kinase kinase kinase 4
(Homo sapiens (Human))
BDBM299536
(6-(2-ethyl-4- pyridyl)pyrido [3,2-d]pyrimidin- 4-a...)
Show SMILES CCc1cc(ccn1)-c1ccc2ncnc(N)c2n1
Show InChI InChI=1S/C14H13N5/c1-2-10-7-9(5-6-16-10)11-3-4-12-13(19-11)14(15)18-8-17-12/h3-8H,2H2,1H3,(H2,15,17,18)
NCI pathway
Reactome pathway
US Patent
n/an/a 204n/an/an/an/an/an/a
Merck Frosst Centre for Therapeutic Research
Assay Description
The kinase activity of purified human MAP4K4 kinase domain was measured by monitoring the phosphorylation of a peptide substrate derived from moesin ...
J Med Chem 46: 3709-27 (2003)
BindingDB Entry DOI: 10.7270/Q2VH5R4B
Mitogen-activated protein kinase kinase kinase kinase 4
(Homo sapiens (Human))
BDBM299536
(6-(2-ethyl-4- pyridyl)pyrido [3,2-d]pyrimidin- 4-a...)
Show SMILES CCc1cc(ccn1)-c1ccc2ncnc(N)c2n1
Show InChI InChI=1S/C14H13N5/c1-2-10-7-9(5-6-16-10)11-3-4-12-13(19-11)14(15)18-8-17-12/h3-8H,2H2,1H3,(H2,15,17,18)
NCI pathway
Reactome pathway
US Patent
n/an/a 204n/an/an/an/an/an/a
Genentech, Inc.
US Patent
Assay Description
The kinase activity of purified human MAP4K4 kinase domain was measured by monitoring the phosphorylation of a peptide substrate derived from moesin ...
US Patent US9592235 (2017)
BindingDB Entry DOI: 10.7270/Q2VX0JKX