BDBM299546 3-(4-aminopyrido [3,2-d]pyrimidin- 6-yl)phenol::US9592235, Example 316::US9855269, Compound 165
SMILES: Nc1ncnc2ccc(nc12)-c1cccc(O)c1
InChI Key: InChIKey=WOKSNYSVJZKCJC-UHFFFAOYSA-N
Data: 2 IC50
Activity Spreadsheet -- Enzyme Inhibition Constant Data from BindingDB
Found 2 hits for monomerid = 299546
Trg + Lig
Ki
nM
ΔG°
kcal/mole
IC50
nM
Kd
nM
EC50/IC50
nM
koff
s-1
kon
M-1s-1
pHTemp
°C
Mitogen-activated protein kinase kinase kinase kinase 4
(Homo sapiens (Human))
BDBM299546
(3-(4-aminopyrido [3,2-d]pyrimidin- 6-yl)phenol | U...)
Show SMILES Nc1ncnc2ccc(nc12)-c1cccc(O)c1
Show InChI InChI=1S/C13H10N4O/c14-13-12-11(15-7-16-13)5-4-10(17-12)8-2-1-3-9(18)6-8/h1-7,18H,(H2,14,15,16)
NCI pathway
Reactome pathway
US Patent
n/an/a 11n/an/an/an/an/an/a
Merck Frosst Centre for Therapeutic Research
Assay Description
The kinase activity of purified human MAP4K4 kinase domain was measured by monitoring the phosphorylation of a peptide substrate derived from moesin ...
J Med Chem 46: 3709-27 (2003)
BindingDB Entry DOI: 10.7270/Q2VH5R4B
Mitogen-activated protein kinase kinase kinase kinase 4
(Homo sapiens (Human))
BDBM299546
(3-(4-aminopyrido [3,2-d]pyrimidin- 6-yl)phenol | U...)
Show SMILES Nc1ncnc2ccc(nc12)-c1cccc(O)c1
Show InChI InChI=1S/C13H10N4O/c14-13-12-11(15-7-16-13)5-4-10(17-12)8-2-1-3-9(18)6-8/h1-7,18H,(H2,14,15,16)
NCI pathway
Reactome pathway
US Patent
n/an/a 11n/an/an/an/an/an/a
Genentech, Inc.
US Patent
Assay Description
The kinase activity of purified human MAP4K4 kinase domain was measured by monitoring the phosphorylation of a peptide substrate derived from moesin ...
US Patent US9592235 (2017)
BindingDB Entry DOI: 10.7270/Q2VX0JKX