BDBM299617 6-[3-(difluoro- methoxy)phenyl] pyrido[3,2-d] pyrimidin-4-amine::US9592235, Example 363::US9855269, Compound 290
SMILES: Nc1ncnc2ccc(nc12)-c1cccc(OC(F)F)c1
InChI Key: InChIKey=MGXSZEBSENIQSJ-UHFFFAOYSA-N
Data: 2 IC50
Activity Spreadsheet -- Enzyme Inhibition Constant Data from BindingDB
Found 2 hits for monomerid = 299617
Trg + Lig
Ki
nM
ΔG°
kcal/mole
IC50
nM
Kd
nM
EC50/IC50
nM
koff
s-1
kon
M-1s-1
pHTemp
°C
Mitogen-activated protein kinase kinase kinase kinase 4
(Homo sapiens (Human))
BDBM299617
(6-[3-(difluoro- methoxy)phenyl] pyrido[3,2-d] pyri...)
Show SMILES Nc1ncnc2ccc(nc12)-c1cccc(OC(F)F)c1
Show InChI InChI=1S/C14H10F2N4O/c15-14(16)21-9-3-1-2-8(6-9)10-4-5-11-12(20-10)13(17)19-7-18-11/h1-7,14H,(H2,17,18,19)
NCI pathway
Reactome pathway
US Patent
n/an/a 71.8n/an/an/an/an/an/a
Merck Frosst Centre for Therapeutic Research
Assay Description
The kinase activity of purified human MAP4K4 kinase domain was measured by monitoring the phosphorylation of a peptide substrate derived from moesin ...
J Med Chem 46: 3709-27 (2003)
BindingDB Entry DOI: 10.7270/Q2VH5R4B
Mitogen-activated protein kinase kinase kinase kinase 4
(Homo sapiens (Human))
BDBM299617
(6-[3-(difluoro- methoxy)phenyl] pyrido[3,2-d] pyri...)
Show SMILES Nc1ncnc2ccc(nc12)-c1cccc(OC(F)F)c1
Show InChI InChI=1S/C14H10F2N4O/c15-14(16)21-9-3-1-2-8(6-9)10-4-5-11-12(20-10)13(17)19-7-18-11/h1-7,14H,(H2,17,18,19)
NCI pathway
Reactome pathway
US Patent
n/an/a 71.8n/an/an/an/an/an/a
Genentech, Inc.
US Patent
Assay Description
The kinase activity of purified human MAP4K4 kinase domain was measured by monitoring the phosphorylation of a peptide substrate derived from moesin ...
US Patent US9592235 (2017)
BindingDB Entry DOI: 10.7270/Q2VX0JKX