BDBM29994 2-Cyclohexylcarbonylbenzimidazole, 7e
SMILES: CCN1CCN(CC1)c1cc2[nH]c(nc2cc1Cl)C(=O)[C@]1(CC)CC[C@@](C)(O)CC1
InChI Key: InChIKey=IVXREHUZWIXJIB-YHBQERECSA-N
Data: 2 IC50  1 EC50
Activity Spreadsheet -- Enzyme Inhibition Constant Data from BindingDB
Found 2 hits for monomerid = 29994
Trg + Lig
Ki
nM
ΔG°
kcal/mole
IC50
nM
Kd
nM
EC50/IC50
nM
koff
s-1
kon
M-1s-1
pHTemp
°C
Potassium voltage-gated channel subfamily H member 2
(Homo sapiens (Human))
BDBM29994
(2-Cyclohexylcarbonylbenzimidazole, 7e)
Show SMILES CCN1CCN(CC1)c1cc2[nH]c(nc2cc1Cl)C(=O)[C@]1(CC)CC[C@@](C)(O)CC1 |r,wU:20.23,25.29,wD:20.22,25.28,(-10.04,.77,;-8.71,,;-7.38,.77,;-7.38,2.31,;-6.04,3.08,;-4.71,2.31,;-4.71,.77,;-6.04,,;-3.38,3.08,;-2.04,2.31,;-.71,3.08,;.76,2.6,;1.66,3.85,;.76,5.1,;-.71,4.62,;-2.04,5.39,;-3.38,4.62,;-4.71,5.39,;3.2,3.85,;3.97,5.18,;4.29,2.76,;4.84,4.2,;6.37,4.44,;5.83,2.84,;6.66,1.54,;5.96,.17,;5.96,-1.37,;7.45,-.23,;4.42,.1,;3.59,1.39,)|
Show InChI InChI=1S/C23H33ClN4O2/c1-4-23(8-6-22(3,30)7-9-23)20(29)21-25-17-14-16(24)19(15-18(17)26-21)28-12-10-27(5-2)11-13-28/h14-15,30H,4-13H2,1-3H3,(H,25,26)/t22-,23-
Reactome pathway
n/an/a 1.10E+4n/an/an/an/a7.422
Banyu Pharmaceutical Co.
Assay Description
Binding affinity to the hERG K+ channel was measured by displacement of [35S]-radiolabeled MK499 in membranes derived from HEK 293 cells stably trans...
Bioorg Med Chem Lett 19: 3096-9 (2009)
Article DOI: 10.1016/j.bmcl.2009.04.023
BindingDB Entry DOI: 10.7270/Q24J0CFR
Nociceptin receptor
(Homo sapiens (Human))
BDBM29994
(2-Cyclohexylcarbonylbenzimidazole, 7e)
Show SMILES CCN1CCN(CC1)c1cc2[nH]c(nc2cc1Cl)C(=O)[C@]1(CC)CC[C@@](C)(O)CC1 |r,wU:20.23,25.29,wD:20.22,25.28,(-10.04,.77,;-8.71,,;-7.38,.77,;-7.38,2.31,;-6.04,3.08,;-4.71,2.31,;-4.71,.77,;-6.04,,;-3.38,3.08,;-2.04,2.31,;-.71,3.08,;.76,2.6,;1.66,3.85,;.76,5.1,;-.71,4.62,;-2.04,5.39,;-3.38,4.62,;-4.71,5.39,;3.2,3.85,;3.97,5.18,;4.29,2.76,;4.84,4.2,;6.37,4.44,;5.83,2.84,;6.66,1.54,;5.96,.17,;5.96,-1.37,;7.45,-.23,;4.42,.1,;3.59,1.39,)|
Show InChI InChI=1S/C23H33ClN4O2/c1-4-23(8-6-22(3,30)7-9-23)20(29)21-25-17-14-16(24)19(15-18(17)26-21)28-12-10-27(5-2)11-13-28/h14-15,30H,4-13H2,1-3H3,(H,25,26)/t22-,23-
Reactome pathway
n/an/a 0.800n/a 2.40n/an/a7.437
Banyu Pharmaceutical Co.
Assay Description
Compounds were tested for their inhibitory effects on ligand binding to the human ORL1 receptor. Bound and free radioligands are separated by filtra...
Bioorg Med Chem Lett 19: 3096-9 (2009)
Article DOI: 10.1016/j.bmcl.2009.04.023
BindingDB Entry DOI: 10.7270/Q24J0CFR