BDBM30031 triazolothiadiazine, 25
SMILES: COc1ccc(cc1OC1CCOC1)C1=Nn2c(SC1)nnc2-c1ccccc1OC
InChI Key: InChIKey=KQYOTSLVCDQZMU-UHFFFAOYSA-N
Data: 1 IC50
Activity Spreadsheet -- Enzyme Inhibition Constant Data from BindingDB
Found 1 hit for monomerid = 30031
Trg + Lig
Ki
nM
ΔG°
kcal/mole
IC50
nM
Kd
nM
EC50/IC50
nM
koff
s-1
kon
M-1s-1
pHTemp
°C
cAMP-specific 3',5'-cyclic phosphodiesterase 4A
(Homo sapiens (Human))
BDBM30031
(triazolothiadiazine, 25)
Show SMILES COc1ccc(cc1OC1CCOC1)C1=Nn2c(SC1)nnc2-c1ccccc1OC |t:16|
Show InChI InChI=1S/C22H22N4O4S/c1-27-18-6-4-3-5-16(18)21-23-24-22-26(21)25-17(13-31-22)14-7-8-19(28-2)20(11-14)30-15-9-10-29-12-15/h3-8,11,15H,9-10,12-13H2,1-2H3
n/an/a 20n/an/an/an/a7.222
National Human Genome Research Institute
Assay Description
Inhibition of PDE4A was performed using IMAP technology (Molecular Devices, CA). PDE4A1A mixture was dispensed into 1536-well black/solid bottom assa...
Bioorg Med Chem Lett 19: 3686-92 (2009)
Article DOI: 10.1016/j.bmcl.2009.01.057
BindingDB Entry DOI: 10.7270/Q2W37TNT