null
SMILES: FC(F)Oc1ccc(cc1OCC1CC1)C1=Nn2c(SC1)nnc2-c1ccccc1Cl
InChI Key: InChIKey=LFZGKSILZCJTOF-UHFFFAOYSA-N
Activity Spreadsheet -- Enzyme Inhibition Constant Data from BindingDB
Found 2 hits for monomerid = 30036
Trg + Lig
Ki
nM
ΔG°
kcal/mole
IC50
nM
Kd
nM
EC50/IC50
nM
koff
s-1
kon
M-1s-1
pHTemp
°C
Integrin alpha-4
(Homo sapiens (Human))
BDBM30036
(cid_44142096 | triazolothiadiazine, 30)
Show SMILES FC(F)Oc1ccc(cc1OCC1CC1)C1=Nn2c(SC1)nnc2-c1ccccc1Cl |t:17|
Show InChI InChI=1S/C21H17ClF2N4O2S/c22-15-4-2-1-3-14(15)19-25-26-21-28(19)27-16(11-31-21)13-7-8-17(30-20(23)24)18(9-13)29-10-12-5-6-12/h1-4,7-9,12,20H,5-6,10-11H2
PCBioAssay
n/an/an/an/a 3.89E+3n/an/an/an/a
NMMLSC
Curated by PubChem BioAssay
Assay Description
University of New Mexico Assay Overview: Assay Support: 1 R01 HL081062-01 Project Title: HTS for Identification of VLA-4 Allosteric Modulators (ML...
PubChem Bioassay (2010)
BindingDB Entry DOI: 10.7270/Q24X5684
cAMP-specific 3',5'-cyclic phosphodiesterase 4A
(Homo sapiens (Human))
BDBM30036
(cid_44142096 | triazolothiadiazine, 30)
Show SMILES FC(F)Oc1ccc(cc1OCC1CC1)C1=Nn2c(SC1)nnc2-c1ccccc1Cl |t:17|
Show InChI InChI=1S/C21H17ClF2N4O2S/c22-15-4-2-1-3-14(15)19-25-26-21-28(19)27-16(11-31-21)13-7-8-17(30-20(23)24)18(9-13)29-10-12-5-6-12/h1-4,7-9,12,20H,5-6,10-11H2
n/an/a 37n/an/an/an/a7.222
National Human Genome Research Institute
Assay Description
Inhibition of PDE4A was performed using IMAP technology (Molecular Devices, CA). PDE4A1A mixture was dispensed into 1536-well black/solid bottom assa...
Bioorg Med Chem Lett 19: 3686-92 (2009)
Article DOI: 10.1016/j.bmcl.2009.01.057
BindingDB Entry DOI: 10.7270/Q2W37TNT