BDBM30037 triazolothiadiazine, 31
SMILES: COc1ccc(cc1OC1CCOC1)C1=Nn2c(SC1)nnc2-c1ccccc1Cl
InChI Key: InChIKey=YFPGZZRWTYUBTB-UHFFFAOYSA-N
Data: 1 IC50
Activity Spreadsheet -- Enzyme Inhibition Constant Data from BindingDB
Found 1 hit for monomerid = 30037
Trg + Lig
Ki
nM
ΔG°
kcal/mole
IC50
nM
Kd
nM
EC50/IC50
nM
koff
s-1
kon
M-1s-1
pHTemp
°C
cAMP-specific 3',5'-cyclic phosphodiesterase 4A
(Homo sapiens (Human))
BDBM30037
(triazolothiadiazine, 31)
Show SMILES COc1ccc(cc1OC1CCOC1)C1=Nn2c(SC1)nnc2-c1ccccc1Cl |t:16|
Show InChI InChI=1S/C21H19ClN4O3S/c1-27-18-7-6-13(10-19(18)29-14-8-9-28-11-14)17-12-30-21-24-23-20(26(21)25-17)15-4-2-3-5-16(15)22/h2-7,10,14H,8-9,11-12H2,1H3
n/an/a 9.80n/an/an/an/a7.222
National Human Genome Research Institute
Assay Description
Inhibition of PDE4A was performed using IMAP technology (Molecular Devices, CA). PDE4A1A mixture was dispensed into 1536-well black/solid bottom assa...
Bioorg Med Chem Lett 19: 3686-92 (2009)
Article DOI: 10.1016/j.bmcl.2009.01.057
BindingDB Entry DOI: 10.7270/Q2W37TNT