BDBM300915 US10131658, Compound 2
SMILES: NCCC(=O)Nc1ccc(C[C@H](NC(=O)[C@@H]2CCCN2S(=O)(=O)c2ccccc2)C(O)=O)cc1
InChI Key: InChIKey=LWNVRRLYEWEYCH-PMACEKPBSA-N
Data: 1 IC50
Activity Spreadsheet -- Enzyme Inhibition Constant Data from BindingDB
Found 1 hit for monomerid = 300915
Trg + Lig
Ki
nM
ΔG°
kcal/mole
IC50
nM
Kd
nM
EC50/IC50
nM
koff
s-1
kon
M-1s-1
pHTemp
°C
Integrin alpha5beta1
(Homo sapiens (Human))
BDBM300915
(US10131658, Compound 2)
Show SMILES NCCC(=O)Nc1ccc(C[C@H](NC(=O)[C@@H]2CCCN2S(=O)(=O)c2ccccc2)C(O)=O)cc1 |r|
Show InChI InChI=1S/C23H28N4O6S/c24-13-12-21(28)25-17-10-8-16(9-11-17)15-19(23(30)31)26-22(29)20-7-4-14-27(20)34(32,33)18-5-2-1-3-6-18/h1-3,5-6,8-11,19-20H,4,7,12-15,24H2,(H,25,28)(H,26,29)(H,30,31)/t19-,20-/m0/s1
NCI pathway
Reactome pathway
US Patent
n/an/a 505n/an/an/an/an/an/a
The Regents of the University of California
US Patent
Assay Description
A panel of cell lines and integrin ligands were developed to allow rapid examination of potency and specificity of inhibitors against all 8 integrins...
US Patent US10131658 (2018)
BindingDB Entry DOI: 10.7270/Q2SX6G8Q