BDBM300927 US10131658, Compound 197
SMILES: [#6]-[#6]-[#7](-[#6]-[#6])-c1ccc2-[#6](=[#6]-3-[#6]=[#6]\[#6](-[#6]-[#6]-3-[#8]-c2c1)=[#7+](/[#6]-[#6])-[#6]-[#6])-c1ccc(cc1S([#8-])(=O)=O)S(=O)(=O)[#7]-[#8]-[#6]-[#6]-[#8]-[#6]-[#6]-[#8]-[#6]-[#6]-[#8]-[#6]-[#6]-[#6](=O)-[#7]-[#6@@H](-[#6]-[#6]-[#7]-[#6](-[#7])=[#7])-[#6](=O)-[#7]-c1ccc(-[#6]-[#6@H](-[#7]-[#6](=O)-[#6]-2-[#6]-[#6]-[#6]-[#7]-2S(=O)(=O)c2ccccc2)-[#6](-[#8])=O)cc1
InChI Key: InChIKey=ISXTXHGLEHLPFN-VDZYBIEISA-N
Data: 1 IC50
Activity Spreadsheet -- Enzyme Inhibition Constant Data from BindingDB
Found 1 hit for monomerid = 300927
Trg + Lig
Ki
nM
ΔG°
kcal/mole
IC50
nM
Kd
nM
EC50/IC50
nM
koff
s-1
kon
M-1s-1
pHTemp
°C
Integrin alpha5beta1
(Homo sapiens (Human))
BDBM300927
(US10131658, Compound 197)
Show SMILES [#6]-[#6]-[#7](-[#6]-[#6])-c1ccc2-[#6](=[#6]-3-[#6]=[#6]\[#6](-[#6]-[#6]-3-[#8]-c2c1)=[#7+](/[#6]-[#6])-[#6]-[#6])-c1ccc(cc1S([#8-])(=O)=O)S(=O)(=O)[#7]-[#8]-[#6]-[#6]-[#8]-[#6]-[#6]-[#8]-[#6]-[#6]-[#8]-[#6]-[#6]-[#6](=O)-[#7]-[#6@@H](-[#6]-[#6]-[#7]-[#6](-[#7])=[#7])-[#6](=O)-[#7]-c1ccc(-[#6]-[#6@H](-[#7]-[#6](=O)-[#6]-2-[#6]-[#6]-[#6]-[#7]-2S(=O)(=O)c2ccccc2)-[#6](-[#8])=O)cc1 |r,c:11,t:9|
Show InChI InChI=1S/C61H80N10O17S3/c1-5-69(6-2)43-20-23-47-53(38-43)88-54-39-44(70(7-3)8-4)21-24-48(54)57(47)49-25-22-46(40-55(49)91(81,82)83)89(77,78)68-87-36-35-86-34-33-85-32-31-84-30-27-56(72)66-50(26-28-64-61(62)63)58(73)65-42-18-16-41(17-19-42)37-51(60(75)76)67-59(74)52-15-12-29-71(52)90(79,80)45-13-10-9-11-14-45/h9-11,13-14,16-25,38,40,50-52,54,68H,5-8,12,15,26-37,39H2,1-4H3,(H8-,62,63,64,65,66,67,72,73,74,75,76,81,82,83)/t50-,51-,52?,54?/m0/s1
NCI pathway
Reactome pathway
US Patent
n/an/a 505n/an/an/an/an/an/a
The Regents of the University of California
US Patent
Assay Description
A panel of cell lines and integrin ligands were developed to allow rapid examination of potency and specificity of inhibitors against all 8 integrins...
US Patent US10131658 (2018)
BindingDB Entry DOI: 10.7270/Q2SX6G8Q