BDBM300982 N-(4-((6R,8R)- 7-(2,2- difluoroethyl)- 8-methyl- 6,7,8,9- tetrahydro-3H- pyrazolo[4,3- f]isoquinolin- 6-yl)phenyl)-1- (3- fluoropropyl) azetidin-3- amine::US10131663, Example 48::US10590130, Example 48::US10961241, Example 48
SMILES: C[C@@H]1Cc2c(ccc3[nH]ncc23)[C@H](N1CC(F)F)c1ccc(NC2CN(CCCF)C2)cc1
InChI Key:
Data: 4 IC50
Activity Spreadsheet -- Enzyme Inhibition Constant Data from BindingDB
Found 4 hits for monomerid = 300982
Trg + Lig
Ki
nM
ΔG°
kcal/mole
IC50
nM
Kd
nM
EC50/IC50
nM
koff
s-1
kon
M-1s-1
pHTemp
°C
Estrogen receptor
(Homo sapiens (Human))
BDBM300982
(N-(4-((6R,8R)- 7-(2,2- difluoroethyl)- 8-methyl- 6...)
Show SMILES C[C@@H]1Cc2c(ccc3[nH]ncc23)[C@H](N1CC(F)F)c1ccc(NC2CN(CCCF)C2)cc1 |r|
US Patent
n/an/a 1.5n/an/an/an/an/an/a
AstraZeneca AB
US Patent
Assay Description
The assay principle is that ER alpha-LBD (GST) is added to a fluorescent ligand to form a receptor/fluorophore complex. A terbium-labelled anti-GST a...
US Patent US10131663 (2018)
BindingDB Entry DOI: 10.7270/Q2P55QJ9
Estrogen receptor [307-554]
(Homo sapiens (Human))
BDBM300982
(N-(4-((6R,8R)- 7-(2,2- difluoroethyl)- 8-methyl- 6...)
Show SMILES C[C@@H]1Cc2c(ccc3[nH]ncc23)[C@H](N1CC(F)F)c1ccc(NC2CN(CCCF)C2)cc1 |r|
US Patent
n/an/a 1.5n/an/an/an/an/an/a
AstraZeneca AB
US Patent
Assay Description
The assay was performed as follows with all reagent additions carried out using the Beckman Coulter BioRAPTR FRD microfluidic workstation:1. Acoustic...
US Patent US10961241 (2021)
Potassium voltage-gated channel subfamily H member 2
(Homo sapiens (Human))
BDBM300982
(N-(4-((6R,8R)- 7-(2,2- difluoroethyl)- 8-methyl- 6...)
Show SMILES C[C@@H]1Cc2c(ccc3[nH]ncc23)[C@H](N1CC(F)F)c1ccc(NC2CN(CCCF)C2)cc1 |r|
Reactome pathway
US Patent
n/an/a 1.5n/an/an/an/an/an/a
AstraZeneca AB
US Patent
Assay Description
hERG (human ether go go-related gene) potassium channels are essential for normal electrical activity in the heart. Arrhythmia can be induced by a bl...
US Patent US10590130 (2020)
Estrogen receptor
(Homo sapiens (Human))
BDBM300982
(N-(4-((6R,8R)- 7-(2,2- difluoroethyl)- 8-methyl- 6...)
Show SMILES C[C@@H]1Cc2c(ccc3[nH]ncc23)[C@H](N1CC(F)F)c1ccc(NC2CN(CCCF)C2)cc1 |r|
US Patent
n/an/a 0.0780n/an/an/an/an/an/a
AstraZeneca AB
US Patent
Assay Description
The ability of compounds to down-regulate Estrogen Receptor (ER) numbers was assessed in a cell based immuno-fluorescence assay using the MCF-7 human...
US Patent US10131663 (2018)
BindingDB Entry DOI: 10.7270/Q2P55QJ9