BDBM301008 4-[5-(4-methylphenyl)-1-[[(3R)- pyrrolidin-3-yl]methyl]pyrrolo[3,2- b]pyridin-6-yl]benzonitrile::US10131664, Example 1::US10543198, Example 1::US10864202, Example 1
SMILES: Cc1ccc(cc1)-c1nc2ccn(C[C@@H]3CCNC3)c2cc1-c1ccc(cc1)C#N
InChI Key: InChIKey=UWAZSGULEBMAMF-HXUWFJFHSA-N
Data: 3 IC50
Activity Spreadsheet -- Enzyme Inhibition Constant Data from BindingDB
Found 3 hits for monomerid = 301008
Trg + Lig
Ki
nM
ΔG°
kcal/mole
IC50
nM
Kd
nM
EC50/IC50
nM
koff
s-1
kon
M-1s-1
pHTemp
°C
Lysine-specific histone demethylase 1A
(Homo sapiens (Human))
BDBM301008
(4-[5-(4-methylphenyl)-1-[[(3R)- pyrrolidin-3-yl]me...)
Show SMILES Cc1ccc(cc1)-c1nc2ccn(C[C@@H]3CCNC3)c2cc1-c1ccc(cc1)C#N |r|
Show InChI InChI=1S/C26H24N4/c1-18-2-6-22(7-3-18)26-23(21-8-4-19(15-27)5-9-21)14-25-24(29-26)11-13-30(25)17-20-10-12-28-16-20/h2-9,11,13-14,20,28H,10,12,16-17H2,1H3/t20-/m1/s1
Reactome pathway
US Patent
n/an/a<10n/an/an/an/an/an/a
Celgene Quanticel Research, Inc.
US Patent
Assay Description
The enzymatic assay of LSD1 activity is based on Time Resolved-Fluorescence Resonance Energy Transfer (TR-FRET) detection. The inhibitory properties ...
US Patent US10131664 (2018)
BindingDB Entry DOI: 10.7270/Q2JD4ZV1
Lysine-specific histone demethylase 1A
(Homo sapiens (Human))
BDBM301008
(4-[5-(4-methylphenyl)-1-[[(3R)- pyrrolidin-3-yl]me...)
Show SMILES Cc1ccc(cc1)-c1nc2ccn(C[C@@H]3CCNC3)c2cc1-c1ccc(cc1)C#N |r|
Show InChI InChI=1S/C26H24N4/c1-18-2-6-22(7-3-18)26-23(21-8-4-19(15-27)5-9-21)14-25-24(29-26)11-13-30(25)17-20-10-12-28-16-20/h2-9,11,13-14,20,28H,10,12,16-17H2,1H3/t20-/m1/s1
Reactome pathway
US Patent
n/an/a<100n/an/an/an/an/an/a
Celgene Quanticel Research, Inc.
US Patent
Assay Description
The enzymatic assay of LSD1 activity is based on Time Resolved-Fluorescence Resonance Energy Transfer (TR-FRET) detection. The inhibitory properties ...
US Patent US10864202 (2020)
Lysine-specific histone demethylase 1A
(Homo sapiens (Human))
BDBM301008
(4-[5-(4-methylphenyl)-1-[[(3R)- pyrrolidin-3-yl]me...)
Show SMILES Cc1ccc(cc1)-c1nc2ccn(C[C@@H]3CCNC3)c2cc1-c1ccc(cc1)C#N |r|
Show InChI InChI=1S/C26H24N4/c1-18-2-6-22(7-3-18)26-23(21-8-4-19(15-27)5-9-21)14-25-24(29-26)11-13-30(25)17-20-10-12-28-16-20/h2-9,11,13-14,20,28H,10,12,16-17H2,1H3/t20-/m1/s1
Reactome pathway
US Patent
n/an/a<100n/an/an/an/an/an/a
Celgene Quanticel Research, Inc.
US Patent
Assay Description
This assay determines the ability of a test compound to inhibit LSD1 demethylase activity. E. coli expressed full-length human LSD1 (Accession number...
US Patent US10543198 (2020)
BindingDB Entry DOI: 10.7270/Q29G5Q6H