BDBM301018 4-[5-(4-fluorophenyl)-1-[[(2R)- morpholin-2-yl]methyl]pyrrolo[3,2- b]pyridin-6-yl]benzonitrile::US10131664, Example 11::US10543198, Example 11::US10864202, Example 11
SMILES: Fc1ccc(cc1)-c1nc2ccn(C[C@H]3CNCCO3)c2cc1-c1ccc(cc1)C#N
InChI Key: InChIKey=LOKJEXGKLOZZND-OAQYLSRUSA-N
Data: 3 IC50
Activity Spreadsheet -- Enzyme Inhibition Constant Data from BindingDB
Found 3 hits for monomerid = 301018
Trg + Lig
Ki
nM
ΔG°
kcal/mole
IC50
nM
Kd
nM
EC50/IC50
nM
koff
s-1
kon
M-1s-1
pHTemp
°C
Lysine-specific histone demethylase 1A
(Homo sapiens (Human))
BDBM301018
(4-[5-(4-fluorophenyl)-1-[[(2R)- morpholin-2-yl]met...)
Show SMILES Fc1ccc(cc1)-c1nc2ccn(C[C@H]3CNCCO3)c2cc1-c1ccc(cc1)C#N |r|
Show InChI InChI=1S/C25H21FN4O/c26-20-7-5-19(6-8-20)25-22(18-3-1-17(14-27)2-4-18)13-24-23(29-25)9-11-30(24)16-21-15-28-10-12-31-21/h1-9,11,13,21,28H,10,12,15-16H2/t21-/m1/s1
Reactome pathway
US Patent
n/an/a<10n/an/an/an/an/an/a
Celgene Quanticel Research, Inc.
US Patent
Assay Description
The enzymatic assay of LSD1 activity is based on Time Resolved-Fluorescence Resonance Energy Transfer (TR-FRET) detection. The inhibitory properties ...
US Patent US10131664 (2018)
BindingDB Entry DOI: 10.7270/Q2JD4ZV1
Lysine-specific histone demethylase 1A
(Homo sapiens (Human))
BDBM301018
(4-[5-(4-fluorophenyl)-1-[[(2R)- morpholin-2-yl]met...)
Show SMILES Fc1ccc(cc1)-c1nc2ccn(C[C@H]3CNCCO3)c2cc1-c1ccc(cc1)C#N |r|
Show InChI InChI=1S/C25H21FN4O/c26-20-7-5-19(6-8-20)25-22(18-3-1-17(14-27)2-4-18)13-24-23(29-25)9-11-30(24)16-21-15-28-10-12-31-21/h1-9,11,13,21,28H,10,12,15-16H2/t21-/m1/s1
Reactome pathway
US Patent
n/an/a<100n/an/an/an/an/an/a
Celgene Quanticel Research, Inc.
US Patent
Assay Description
The enzymatic assay of LSD1 activity is based on Time Resolved-Fluorescence Resonance Energy Transfer (TR-FRET) detection. The inhibitory properties ...
US Patent US10864202 (2020)
Lysine-specific histone demethylase 1A
(Homo sapiens (Human))
BDBM301018
(4-[5-(4-fluorophenyl)-1-[[(2R)- morpholin-2-yl]met...)
Show SMILES Fc1ccc(cc1)-c1nc2ccn(C[C@H]3CNCCO3)c2cc1-c1ccc(cc1)C#N |r|
Show InChI InChI=1S/C25H21FN4O/c26-20-7-5-19(6-8-20)25-22(18-3-1-17(14-27)2-4-18)13-24-23(29-25)9-11-30(24)16-21-15-28-10-12-31-21/h1-9,11,13,21,28H,10,12,15-16H2/t21-/m1/s1
Reactome pathway
US Patent
n/an/a<100n/an/an/an/an/an/a
Celgene Quanticel Research, Inc.
US Patent
Assay Description
This assay determines the ability of a test compound to inhibit LSD1 demethylase activity. E. coli expressed full-length human LSD1 (Accession number...
US Patent US10543198 (2020)
BindingDB Entry DOI: 10.7270/Q29G5Q6H