BDBM301019 4-[1-(3-aminopropyl)-5-(4- methylphenyl)pyrrolo[3,2-b]44yridine- 6-yl]benzonitrile::US10131664, Example 12::US10543198, Example 12::US10864202, Example 12
SMILES: Cc1ccc(cc1)-c1nc2ccn(CCCN)c2cc1-c1ccc(cc1)C#N
InChI Key: InChIKey=QKLRUAXWISSMAV-UHFFFAOYSA-N
Data: 3 IC50
Activity Spreadsheet -- Enzyme Inhibition Constant Data from BindingDB
Found 3 hits for monomerid = 301019
Trg + Lig
Ki
nM
ΔG°
kcal/mole
IC50
nM
Kd
nM
EC50/IC50
nM
koff
s-1
kon
M-1s-1
pHTemp
°C
Lysine-specific histone demethylase 1A
(Homo sapiens (Human))
BDBM301019
(4-[1-(3-aminopropyl)-5-(4- methylphenyl)pyrrolo[3,...)
Show SMILES Cc1ccc(cc1)-c1nc2ccn(CCCN)c2cc1-c1ccc(cc1)C#N
Show InChI InChI=1S/C24H22N4/c1-17-3-7-20(8-4-17)24-21(19-9-5-18(16-26)6-10-19)15-23-22(27-24)11-14-28(23)13-2-12-25/h3-11,14-15H,2,12-13,25H2,1H3
Reactome pathway
US Patent
n/an/a<10n/an/an/an/an/an/a
Celgene Quanticel Research, Inc.
US Patent
Assay Description
The enzymatic assay of LSD1 activity is based on Time Resolved-Fluorescence Resonance Energy Transfer (TR-FRET) detection. The inhibitory properties ...
US Patent US10131664 (2018)
BindingDB Entry DOI: 10.7270/Q2JD4ZV1
Lysine-specific histone demethylase 1A
(Homo sapiens (Human))
BDBM301019
(4-[1-(3-aminopropyl)-5-(4- methylphenyl)pyrrolo[3,...)
Show SMILES Cc1ccc(cc1)-c1nc2ccn(CCCN)c2cc1-c1ccc(cc1)C#N
Show InChI InChI=1S/C24H22N4/c1-17-3-7-20(8-4-17)24-21(19-9-5-18(16-26)6-10-19)15-23-22(27-24)11-14-28(23)13-2-12-25/h3-11,14-15H,2,12-13,25H2,1H3
Reactome pathway
US Patent
n/an/a<100n/an/an/an/an/an/a
Celgene Quanticel Research, Inc.
US Patent
Assay Description
The enzymatic assay of LSD1 activity is based on Time Resolved-Fluorescence Resonance Energy Transfer (TR-FRET) detection. The inhibitory properties ...
US Patent US10864202 (2020)
Lysine-specific histone demethylase 1A
(Homo sapiens (Human))
BDBM301019
(4-[1-(3-aminopropyl)-5-(4- methylphenyl)pyrrolo[3,...)
Show SMILES Cc1ccc(cc1)-c1nc2ccn(CCCN)c2cc1-c1ccc(cc1)C#N
Show InChI InChI=1S/C24H22N4/c1-17-3-7-20(8-4-17)24-21(19-9-5-18(16-26)6-10-19)15-23-22(27-24)11-14-28(23)13-2-12-25/h3-11,14-15H,2,12-13,25H2,1H3
Reactome pathway
US Patent
n/an/a<100n/an/an/an/an/an/a
Celgene Quanticel Research, Inc.
US Patent
Assay Description
This assay determines the ability of a test compound to inhibit LSD1 demethylase activity. E. coli expressed full-length human LSD1 (Accession number...
US Patent US10543198 (2020)
BindingDB Entry DOI: 10.7270/Q29G5Q6H