BDBM30138 alpha-sulfone piperidine hydroxamate, 11c
SMILES: CC(=O)N1CCC(CC1)(C(=O)NO)S(=O)(=O)c1ccc(OCc2cc(C)nc3ccccc23)cc1
InChI Key: InChIKey=VOYWXVODQDUTJD-UHFFFAOYSA-N
Data: 3 IC50
Activity Spreadsheet -- Enzyme Inhibition Constant Data from BindingDB
Found 3 hits for monomerid = 30138
Trg + Lig
Ki
nM
ΔG°
kcal/mole
IC50
nM
Kd
nM
EC50/IC50
nM
koff
s-1
kon
M-1s-1
pHTemp
°C
Disintegrin and metalloproteinase domain-containing protein 17
(Homo sapiens (Human))
BDBM30138
(alpha-sulfone piperidine hydroxamate, 11c)
Show SMILES CC(=O)N1CCC(CC1)(C(=O)NO)S(=O)(=O)c1ccc(OCc2cc(C)nc3ccccc23)cc1
Show InChI InChI=1S/C25H27N3O6S/c1-17-15-19(22-5-3-4-6-23(22)26-17)16-34-20-7-9-21(10-8-20)35(32,33)25(24(30)27-31)11-13-28(14-12-25)18(2)29/h3-10,15,31H,11-14,16H2,1-2H3,(H,27,30)
Reactome pathway
n/an/a 1n/an/an/an/a7.422
Wyeth Research
Assay Description
Compounds were tested for their ability to inhibit the cleavage of the substrate by the purified enzyme in a fluorescence-based fluorescence resonanc...
Bioorg Med Chem Lett 19: 3445-8 (2009)
Article DOI: 10.1016/j.bmcl.2009.05.020
BindingDB Entry DOI: 10.7270/Q2GT5KHW
Collagenase 3
(Homo sapiens (Human))
BDBM30138
(alpha-sulfone piperidine hydroxamate, 11c)
Show SMILES CC(=O)N1CCC(CC1)(C(=O)NO)S(=O)(=O)c1ccc(OCc2cc(C)nc3ccccc23)cc1
Show InChI InChI=1S/C25H27N3O6S/c1-17-15-19(22-5-3-4-6-23(22)26-17)16-34-20-7-9-21(10-8-20)35(32,33)25(24(30)27-31)11-13-28(14-12-25)18(2)29/h3-10,15,31H,11-14,16H2,1-2H3,(H,27,30)
NCI pathway
Reactome pathway
n/an/a 1.34E+3n/an/an/an/an/a25
Wyeth Research
Assay Description
A continuous assay was used in which the substrate is a synthetic peptide containing a fluorescent group (7-methoxycoumarin), which is quenched by en...
Bioorg Med Chem Lett 19: 3445-8 (2009)
Article DOI: 10.1016/j.bmcl.2009.05.020
BindingDB Entry DOI: 10.7270/Q2GT5KHW
72 kDa type IV collagenase
(Homo sapiens (Human))
BDBM30138
(alpha-sulfone piperidine hydroxamate, 11c)
Show SMILES CC(=O)N1CCC(CC1)(C(=O)NO)S(=O)(=O)c1ccc(OCc2cc(C)nc3ccccc23)cc1
Show InChI InChI=1S/C25H27N3O6S/c1-17-15-19(22-5-3-4-6-23(22)26-17)16-34-20-7-9-21(10-8-20)35(32,33)25(24(30)27-31)11-13-28(14-12-25)18(2)29/h3-10,15,31H,11-14,16H2,1-2H3,(H,27,30)
Reactome pathway
n/an/a 6.96E+3n/an/an/an/an/a25
Wyeth Research
Assay Description
A continuous assay was used in which the substrate is a synthetic peptide containing a fluorescent group (7-methoxycoumarin), which is quenched by en...
Bioorg Med Chem Lett 19: 3445-8 (2009)
Article DOI: 10.1016/j.bmcl.2009.05.020
BindingDB Entry DOI: 10.7270/Q2GT5KHW