BDBM30154 alpha-sulfone piperidine hydroxamate, 11m
SMILES: Cc1cc(COc2ccc(cc2)S(=O)(=O)C2(CCN(CC2)S(C)(=O)=O)C(=O)NO)c2ccccc2n1
InChI Key: InChIKey=CXZHJWRHSTZNHB-UHFFFAOYSA-N
Data: 3 IC50
Activity Spreadsheet -- Enzyme Inhibition Constant Data from BindingDB
Found 3 hits for monomerid = 30154
Trg + Lig
Ki
nM
ΔG°
kcal/mole
IC50
nM
Kd
nM
EC50/IC50
nM
koff
s-1
kon
M-1s-1
pHTemp
°C
Disintegrin and metalloproteinase domain-containing protein 17
(Homo sapiens (Human))
BDBM30154
(alpha-sulfone piperidine hydroxamate, 11m)
Show SMILES Cc1cc(COc2ccc(cc2)S(=O)(=O)C2(CCN(CC2)S(C)(=O)=O)C(=O)NO)c2ccccc2n1
Show InChI InChI=1S/C24H27N3O7S2/c1-17-15-18(21-5-3-4-6-22(21)25-17)16-34-19-7-9-20(10-8-19)36(32,33)24(23(28)26-29)11-13-27(14-12-24)35(2,30)31/h3-10,15,29H,11-14,16H2,1-2H3,(H,26,28)
Reactome pathway
n/an/a 1.20n/an/an/an/a7.422
Wyeth Research
Assay Description
Compounds were tested for their ability to inhibit the cleavage of the substrate by the purified enzyme in a fluorescence-based fluorescence resonanc...
Bioorg Med Chem Lett 19: 3445-8 (2009)
Article DOI: 10.1016/j.bmcl.2009.05.020
BindingDB Entry DOI: 10.7270/Q2GT5KHW
Collagenase 3
(Homo sapiens (Human))
BDBM30154
(alpha-sulfone piperidine hydroxamate, 11m)
Show SMILES Cc1cc(COc2ccc(cc2)S(=O)(=O)C2(CCN(CC2)S(C)(=O)=O)C(=O)NO)c2ccccc2n1
Show InChI InChI=1S/C24H27N3O7S2/c1-17-15-18(21-5-3-4-6-22(21)25-17)16-34-19-7-9-20(10-8-19)36(32,33)24(23(28)26-29)11-13-27(14-12-24)35(2,30)31/h3-10,15,29H,11-14,16H2,1-2H3,(H,26,28)
NCI pathway
Reactome pathway
n/an/a 393n/an/an/an/an/a25
Wyeth Research
Assay Description
A continuous assay was used in which the substrate is a synthetic peptide containing a fluorescent group (7-methoxycoumarin), which is quenched by en...
Bioorg Med Chem Lett 19: 3445-8 (2009)
Article DOI: 10.1016/j.bmcl.2009.05.020
BindingDB Entry DOI: 10.7270/Q2GT5KHW
72 kDa type IV collagenase
(Homo sapiens (Human))
BDBM30154
(alpha-sulfone piperidine hydroxamate, 11m)
Show SMILES Cc1cc(COc2ccc(cc2)S(=O)(=O)C2(CCN(CC2)S(C)(=O)=O)C(=O)NO)c2ccccc2n1
Show InChI InChI=1S/C24H27N3O7S2/c1-17-15-18(21-5-3-4-6-22(21)25-17)16-34-19-7-9-20(10-8-19)36(32,33)24(23(28)26-29)11-13-27(14-12-24)35(2,30)31/h3-10,15,29H,11-14,16H2,1-2H3,(H,26,28)
Reactome pathway
n/an/a 1.74E+3n/an/an/an/an/a25
Wyeth Research
Assay Description
A continuous assay was used in which the substrate is a synthetic peptide containing a fluorescent group (7-methoxycoumarin), which is quenched by en...
Bioorg Med Chem Lett 19: 3445-8 (2009)
Article DOI: 10.1016/j.bmcl.2009.05.020
BindingDB Entry DOI: 10.7270/Q2GT5KHW