BDBM301554 US10131675, Example 40
SMILES: CC1(C)OCCn2c1nc1c(nc(nc21)-c1cnc2[nH]cc(Cl)c2c1)N1CC(O)C1
InChI Key: InChIKey=YGBONFAQIIELTF-UHFFFAOYSA-N
Data: 1 KI
Activity Spreadsheet -- Enzyme Inhibition Constant Data from BindingDB
Found 1 hit for monomerid = 301554
Trg + Lig
Ki
nM
ΔG°
kcal/mole
IC50
nM
Kd
nM
EC50/IC50
nM
koff
s-1
kon
M-1s-1
pHTemp
°C
Mitogen-activated protein kinase kinase kinase 12
(Homo sapiens (Human))
BDBM301554
(US10131675, Example 40)
Show SMILES CC1(C)OCCn2c1nc1c(nc(nc21)-c1cnc2[nH]cc(Cl)c2c1)N1CC(O)C1
Show InChI InChI=1S/C20H20ClN7O2/c1-20(2)19-24-14-17(27-8-11(29)9-27)25-15(26-18(14)28(19)3-4-30-20)10-5-12-13(21)7-23-16(12)22-6-10/h5-7,11,29H,3-4,8-9H2,1-2H3,(H,22,23)
US Patent
5.91n/an/an/an/an/an/an/an/a
Genentech, Inc.
US Patent
Assay Description
DLK kinase reactions (20 μL) containing 5 nM N-terminally GST-tagged DLK (catalytic domain amino acid 1-520) (Carna Bioscience), 40 nM N-termina...
US Patent US10131675 (2018)
BindingDB Entry DOI: 10.7270/Q21G0P92