BDBM3016 3-((4-Aminophenyl)amino)-4-((3-chlorophenyl)amino)-1H-pyrazolo[3,4-d]pyrimidine::3-N-(4-aminophenyl)-4-N-(3-chlorophenyl)-1H-pyrazolo[3,4-d]pyrimidine-3,4-diamine::4-(Phenylamino)pyrazolo[3,4-d]pyrimidine deriv. 17
SMILES: Nc1ccc(Nc2[nH]nc3ncnc(Nc4cccc(Cl)c4)c23)cc1
InChI Key: InChIKey=KMXFOTQAKQWIOA-UHFFFAOYSA-N
Data: 5 IC50
Activity Spreadsheet -- Enzyme Inhibition Constant Data from BindingDB
Found 5 hits for monomerid = 3016
Trg + Lig
Ki
nM
ΔG°
kcal/mole
IC50
nM
Kd
nM
EC50/IC50
nM
koff
s-1
kon
M-1s-1
pHTemp
°C
Epidermal growth factor receptor
(Homo sapiens (Human))
BDBM3016
(3-((4-Aminophenyl)amino)-4-((3-chlorophenyl)amino)...)
Show SMILES Nc1ccc(Nc2[nH]nc3ncnc(Nc4cccc(Cl)c4)c23)cc1
Show InChI InChI=1S/C17H14ClN7/c18-10-2-1-3-13(8-10)23-15-14-16(21-9-20-15)24-25-17(14)22-12-6-4-11(19)5-7-12/h1-9H,19H2,(H3,20,21,22,23,24,25)
n/an/a 5n/an/an/an/an/an/a
Novartis Pharmaceuticals
Assay Description
IC50 is the inhibitor concentration which inhibits 50% of kinase activity that catalyzes the transfer of the terminal phosphate from [gamma-32P] labe...
J Med Chem 40: 3601-16 (1997)
Article DOI: 10.1021/jm970124v
BindingDB Entry DOI: 10.7270/Q2H70D0N
Tyrosine-protein kinase transforming protein Abl
(Abelson murine leukemia virus)
BDBM3016
(3-((4-Aminophenyl)amino)-4-((3-chlorophenyl)amino)...)
Show SMILES Nc1ccc(Nc2[nH]nc3ncnc(Nc4cccc(Cl)c4)c23)cc1
Show InChI InChI=1S/C17H14ClN7/c18-10-2-1-3-13(8-10)23-15-14-16(21-9-20-15)24-25-17(14)22-12-6-4-11(19)5-7-12/h1-9H,19H2,(H3,20,21,22,23,24,25)
n/an/a 1.18E+3n/an/an/an/an/an/a
Novartis Pharmaceuticals
Assay Description
IC50 is the inhibitor concentration which inhibits 50% of kinase activity that catalyzes the transfer of the terminal phosphate from [gamma-32P] labe...
J Med Chem 40: 3601-16 (1997)
Article DOI: 10.1021/jm970124v
BindingDB Entry DOI: 10.7270/Q2H70D0N
Cyclin-Dependent Kinase 1 (CDK1)
(Homo sapiens (Human))
BDBM3016
(3-((4-Aminophenyl)amino)-4-((3-chlorophenyl)amino)...)
Show SMILES Nc1ccc(Nc2[nH]nc3ncnc(Nc4cccc(Cl)c4)c23)cc1
Show InChI InChI=1S/C17H14ClN7/c18-10-2-1-3-13(8-10)23-15-14-16(21-9-20-15)24-25-17(14)22-12-6-4-11(19)5-7-12/h1-9H,19H2,(H3,20,21,22,23,24,25)
Reactome pathway
n/an/a<1.00E+4n/an/an/an/an/an/a
Novartis Pharmaceuticals
Assay Description
IC50 is the inhibitor concentration which inhibits 50% of kinase activity that catalyzes the transfer of the terminal phosphate from [gamma-32P] labe...
J Med Chem 40: 3601-16 (1997)
Article DOI: 10.1021/jm970124v
BindingDB Entry DOI: 10.7270/Q2H70D0N
Protein Kinase C, alpha
(Bos taurus (bovine))
BDBM3016
(3-((4-Aminophenyl)amino)-4-((3-chlorophenyl)amino)...)
Show SMILES Nc1ccc(Nc2[nH]nc3ncnc(Nc4cccc(Cl)c4)c23)cc1
Show InChI InChI=1S/C17H14ClN7/c18-10-2-1-3-13(8-10)23-15-14-16(21-9-20-15)24-25-17(14)22-12-6-4-11(19)5-7-12/h1-9H,19H2,(H3,20,21,22,23,24,25)
Reactome pathway
n/an/a>1.00E+3n/an/an/an/an/an/a
Novartis Pharmaceuticals
Assay Description
IC50 is the inhibitor concentration which inhibits 50% of kinase activity that catalyzes the transfer of the terminal phosphate from [gamma-32P] labe...
J Med Chem 40: 3601-16 (1997)
Article DOI: 10.1021/jm970124v
BindingDB Entry DOI: 10.7270/Q2H70D0N
Proto-oncogene tyrosine-protein kinase Src
(Homo sapiens (Human))
BDBM3016
(3-((4-Aminophenyl)amino)-4-((3-chlorophenyl)amino)...)
Show SMILES Nc1ccc(Nc2[nH]nc3ncnc(Nc4cccc(Cl)c4)c23)cc1
Show InChI InChI=1S/C17H14ClN7/c18-10-2-1-3-13(8-10)23-15-14-16(21-9-20-15)24-25-17(14)22-12-6-4-11(19)5-7-12/h1-9H,19H2,(H3,20,21,22,23,24,25)
n/an/a 2.40E+3n/an/an/an/an/an/a
Novartis Pharmaceuticals
Assay Description
IC50 is the inhibitor concentration which inhibits 50% of kinase activity that catalyzes the transfer of the terminal phosphate from [gamma-32P] labe...
J Med Chem 40: 3601-16 (1997)
Article DOI: 10.1021/jm970124v
BindingDB Entry DOI: 10.7270/Q2H70D0N