BDBM301776 US9597318, Code GK152
SMILES: CCOC(=O)c1csc(n1)C(=O)CCCCc1ccccc1
InChI Key: InChIKey=MQVZZVTWRKNZKB-UHFFFAOYSA-N
Data: 1 IC50
Activity Spreadsheet -- Enzyme Inhibition Constant Data from BindingDB
Found 1 hit for monomerid = 301776
Trg + Lig
Ki
nM
ΔG°
kcal/mole
IC50
nM
Kd
nM
EC50/IC50
nM
koff
s-1
kon
M-1s-1
pHTemp
°C
Cytosolic phospholipase A2
(Homo sapiens (Human))
BDBM301776
(US9597318, Code GK152)
Show SMILES CCOC(=O)c1csc(n1)C(=O)CCCCc1ccccc1
Show InChI InChI=1S/C17H19NO3S/c1-2-21-17(20)14-12-22-16(18-14)15(19)11-7-6-10-13-8-4-3-5-9-13/h3-5,8-9,12H,2,6-7,10-11H2,1H3
US Patent
n/an/a>5.00E+3n/an/an/an/an/an/a
Avexxin AS
US Patent
Assay Description
Assay for cPLA2 activity was performed by the use of sonicated vesicles of 1-palmitoyl-2-arachidonoyl-sn-glycerol-3-phosphorylcholine (100 μM) c...
US Patent US9597318 (2017)
BindingDB Entry DOI: 10.7270/Q2HH6N4C