BDBM301778 US9597318, Code GK160
SMILES: CCCCCCCCCCCCCCC(=O)c1nc(cs1)C(O)=O
InChI Key: InChIKey=BFXJRWNXRVWTAA-UHFFFAOYSA-N
Data: 1 IC50
Activity Spreadsheet -- Enzyme Inhibition Constant Data from BindingDB
Found 1 hit for monomerid = 301778
Trg + Lig
Ki
nM
ΔG°
kcal/mole
IC50
nM
Kd
nM
EC50/IC50
nM
koff
s-1
kon
M-1s-1
pHTemp
°C
Cytosolic phospholipase A2
(Homo sapiens (Human))
BDBM301778
(US9597318, Code GK160)
Show SMILES CCCCCCCCCCCCCCC(=O)c1nc(cs1)C(O)=O
Show InChI InChI=1S/C19H31NO3S/c1-2-3-4-5-6-7-8-9-10-11-12-13-14-17(21)18-20-16(15-24-18)19(22)23/h15H,2-14H2,1H3,(H,22,23)
US Patent
n/an/a 7.20E+3n/an/an/an/an/an/a
Avexxin AS
US Patent
Assay Description
Assay for cPLA2 activity was performed by the use of sonicated vesicles of 1-palmitoyl-2-arachidonoyl-sn-glycerol-3-phosphorylcholine (100 μM) c...
US Patent US9597318 (2017)
BindingDB Entry DOI: 10.7270/Q2HH6N4C