BDBM30186 Pyrrolopyridine, 17
SMILES: Oc1ccccc1-c1cc(ccn1)-c1cc2c(CCNC2=O)[nH]1
InChI Key: InChIKey=RXYYYEKFDHPCFL-UHFFFAOYSA-N
Data: 1 IC50
Activity Spreadsheet -- Enzyme Inhibition Constant Data from BindingDB
Found 1 hit for monomerid = 30186
Trg + Lig
Ki
nM
ΔG°
kcal/mole
IC50
nM
Kd
nM
EC50/IC50
nM
koff
s-1
kon
M-1s-1
pHTemp
°C
MAP kinase-activated protein kinase 2
(Homo sapiens (Human))
BDBM30186
(Pyrrolopyridine, 17)
Show SMILES Oc1ccccc1-c1cc(ccn1)-c1cc2c(CCNC2=O)[nH]1
Show InChI InChI=1S/C18H15N3O2/c22-17-4-2-1-3-12(17)16-9-11(5-7-19-16)15-10-13-14(21-15)6-8-20-18(13)23/h1-5,7,9-10,21-22H,6,8H2,(H,20,23)
NCI pathway
Reactome pathway
n/an/a 410n/an/an/an/a7.530
Pfizer
Assay Description
The phosphorylation of HSP27 peptide by MAPKAPK2 was measured using an anion exchange resin capture assay method. The reaction was carried out in rea...
J Med Chem 50: 2647-54 (2007)
Article DOI: 10.1021/jm0611004
BindingDB Entry DOI: 10.7270/Q2794313