BDBM30193 Pyrrolopyridine, 24
SMILES: Fc1cccc(c1)-c1cc(ccn1)-c1cc2c(CCNC2=O)[nH]1
InChI Key: InChIKey=VPOIDAJRXSIWRX-UHFFFAOYSA-N
Data: 1 IC50
Activity Spreadsheet -- Enzyme Inhibition Constant Data from BindingDB
Found 1 hit for monomerid = 30193
Trg + Lig
Ki
nM
ΔG°
kcal/mole
IC50
nM
Kd
nM
EC50/IC50
nM
koff
s-1
kon
M-1s-1
pHTemp
°C
MAP kinase-activated protein kinase 2
(Homo sapiens (Human))
BDBM30193
(Pyrrolopyridine, 24)
Show SMILES Fc1cccc(c1)-c1cc(ccn1)-c1cc2c(CCNC2=O)[nH]1
Show InChI InChI=1S/C18H14FN3O/c19-13-3-1-2-11(8-13)16-9-12(4-6-20-16)17-10-14-15(22-17)5-7-21-18(14)23/h1-4,6,8-10,22H,5,7H2,(H,21,23)
NCI pathway
Reactome pathway
n/an/a 30n/an/an/an/a7.530
Pfizer
Assay Description
The phosphorylation of HSP27 peptide by MAPKAPK2 was measured using an anion exchange resin capture assay method. The reaction was carried out in rea...
J Med Chem 50: 2647-54 (2007)
Article DOI: 10.1021/jm0611004
BindingDB Entry DOI: 10.7270/Q2794313
3D
3D Structure (docked)