null
SMILES: COc1cc(OC)nc(n1)N1CCN(CCCCc2c[nH]c3ccc(cc23)C#N)CC1
InChI Key: InChIKey=RFQIQFMMPBNHCE-UHFFFAOYSA-N
Activity Spreadsheet -- Enzyme Inhibition Constant Data from BindingDB
Found 1 hit for monomerid = 301951
Trg + Lig
Ki
nM
ΔG°
kcal/mole
IC50
nM
Kd
nM
EC50/IC50
nM
koff
s-1
kon
M-1s-1
pHTemp
°C
5-hydroxytryptamine receptor 1A
(Homo sapiens (Human))
BDBM301951
(3-(4-(4-(4,6-Dimethoxypyrimidin-2-yl)piperazin-1-y...)
Show SMILES COc1cc(OC)nc(n1)N1CCN(CCCCc2c[nH]c3ccc(cc23)C#N)CC1
Show InChI InChI=1S/C23H28N6O2/c1-30-21-14-22(31-2)27-23(26-21)29-11-9-28(10-12-29)8-4-3-5-18-16-25-20-7-6-17(15-24)13-19(18)20/h6-7,13-14,16,25H,3-5,8-12H2,1-2H3
US Patent
2.30n/an/an/an/an/an/an/an/a
SUNSHINE LAKE PHARMA CO., LTD.
US Patent
Assay Description
Human HEK-293 cell homogenates (36 μg protein) were incubated at 22° C. for 60 minutes with 0.3 nM [3H]8-OH-DPAT (Perkin-Elmer) in the absence o...
US Patent US9598401 (2017)
BindingDB Entry DOI: 10.7270/Q2GH9M1F