null
SMILES: COc1ccc2[nH]cc(CCCN3CCN(CC3)c3nc(OC)cc(OC)n3)c2c1
InChI Key: InChIKey=UGYUNLVSNHRMPQ-UHFFFAOYSA-N
Activity Spreadsheet -- Enzyme Inhibition Constant Data from BindingDB
Found 1 hit for monomerid = 301953
Trg + Lig
Ki
nM
ΔG°
kcal/mole
IC50
nM
Kd
nM
EC50/IC50
nM
koff
s-1
kon
M-1s-1
pHTemp
°C
5-hydroxytryptamine receptor 1A
(Homo sapiens (Human))
BDBM301953
(3-(3-(4-(4,6-Dimethoxypyrimidin-2-yl)piperazin-1-y...)
Show SMILES COc1ccc2[nH]cc(CCCN3CCN(CC3)c3nc(OC)cc(OC)n3)c2c1
Show InChI InChI=1S/C22H29N5O3/c1-28-17-6-7-19-18(13-17)16(15-23-19)5-4-8-26-9-11-27(12-10-26)22-24-20(29-2)14-21(25-22)30-3/h6-7,13-15,23H,4-5,8-12H2,1-3H3
US Patent
0.190n/an/an/an/an/an/an/an/a
SUNSHINE LAKE PHARMA CO., LTD.
US Patent
Assay Description
Human HEK-293 cell homogenates (36 μg protein) were incubated at 22° C. for 60 minutes with 0.3 nM [3H]8-OH-DPAT (Perkin-Elmer) in the absence o...
US Patent US9598401 (2017)
BindingDB Entry DOI: 10.7270/Q2GH9M1F