null
SMILES: Cc1nc(sc1C#N)N1CCN(CCCc2c[nH]c3ccc(cc23)C#N)CC1
InChI Key: InChIKey=HHFNTKODSNPUTD-UHFFFAOYSA-N
Activity Spreadsheet -- Enzyme Inhibition Constant Data from BindingDB
Found 1 hit for monomerid = 301992
Trg + Lig
Ki
nM
ΔG°
kcal/mole
IC50
nM
Kd
nM
EC50/IC50
nM
koff
s-1
kon
M-1s-1
pHTemp
°C
5-hydroxytryptamine receptor 1A
(Homo sapiens (Human))
BDBM301992
(2-(4-(3-(5-Cyano-1H-indol-3-yl)propyl)piperazin-1-...)
Show SMILES Cc1nc(sc1C#N)N1CCN(CCCc2c[nH]c3ccc(cc23)C#N)CC1
Show InChI InChI=1S/C21H22N6S/c1-15-20(13-23)28-21(25-15)27-9-7-26(8-10-27)6-2-3-17-14-24-19-5-4-16(12-22)11-18(17)19/h4-5,11,14,24H,2-3,6-10H2,1H3
US Patent
2.60n/an/an/an/an/an/an/an/a
SUNSHINE LAKE PHARMA CO., LTD.
US Patent
Assay Description
Human HEK-293 cell homogenates (36 μg protein) were incubated at 22° C. for 60 minutes with 0.3 nM [3H]8-OH-DPAT (Perkin-Elmer) in the absence o...
US Patent US9598401 (2017)
BindingDB Entry DOI: 10.7270/Q2GH9M1F