BDBM302002 US9598405, 2.1
SMILES:
InChI Key: InChIKey=WGLMYJBYLNYKQR-UHFFFAOYSA-N
Data: 1 IC50
Activity Spreadsheet -- Enzyme Inhibition Constant Data from BindingDB
Found 1 hit for monomerid = 302002
Trg + Lig
Ki
nM
ΔG°
kcal/mole
IC50
nM
Kd
nM
EC50/IC50
nM
koff
s-1
kon
M-1s-1
pHTemp
°C
Tyrosine-protein kinase SYK
(Homo sapiens (Human))
BDBM302002
(US9598405, 2.1)
Show InChI InChI=1S/C23H23N7O3S/c1-13-8-16(18-12-25-22(34-18)23(33)5-2-14(3-6-23)21(31)32)27-20(9-13)28-19-10-15(4-7-24-19)17-11-26-30-29-17/h4,7-12,14,33H,2-3,5-6H2,1H3,(H,31,32)(H,24,27,28)(H,26,29,30)
NCI pathway
Reactome pathway
US Patent
n/an/a 0.0720n/an/an/an/an/an/a
Merck Sharp & Dohme Corp.
US Patent
Assay Description
A recombinant GST-hSYK fusion protein was used to measure potency of compounds to inhibit human Syk activity. The recombinant human GST-SYK (Carna Bi...
US Patent US9598405 (2017)
BindingDB Entry DOI: 10.7270/Q2BR8V7T