null
SMILES:
InChI Key: InChIKey=SMNXOMWRXYQXSG-UHFFFAOYSA-N
Activity Spreadsheet -- Enzyme Inhibition Constant Data from BindingDB
Found 1 hit for monomerid = 302038
Trg + Lig
Ki
nM
ΔG°
kcal/mole
IC50
nM
Kd
nM
EC50/IC50
nM
koff
s-1
kon
M-1s-1
pHTemp
°C
Tyrosine-protein kinase SYK
(Homo sapiens (Human))
BDBM302038
(US9598405, 4.5)
Show InChI InChI=1S/C24H28N4O4S/c1-14(2)32-17-6-9-25-20(12-17)28-21-11-15(3)10-18(27-21)19-13-26-23(33-19)24(31)7-4-16(5-8-24)22(29)30/h6,9-14,16,31H,4-5,7-8H2,1-3H3,(H,29,30)(H,25,27,28)
NCI pathway
Reactome pathway
US Patent
n/an/a 0.862n/an/an/an/an/an/a
Merck Sharp & Dohme Corp.
US Patent
Assay Description
A recombinant GST-hSYK fusion protein was used to measure potency of compounds to inhibit human Syk activity. The recombinant human GST-SYK (Carna Bi...
US Patent US9598405 (2017)
BindingDB Entry DOI: 10.7270/Q2BR8V7T