BDBM302042 US9598405, 5.1
SMILES: C[C@@H]1C[C@](O)(CC[C@@H]1C(O)=O)c1ncc(s1)-c1cc(C)cc(Nc2cc(C)c(F)cn2)n1
InChI Key: InChIKey=LCLISMCSKAWCMI-HUYGQZFBSA-N
Data: 1 IC50
Activity Spreadsheet -- Enzyme Inhibition Constant Data from BindingDB
Found 1 hit for monomerid = 302042
Trg + Lig
Ki
nM
ΔG°
kcal/mole
IC50
nM
Kd
nM
EC50/IC50
nM
koff
s-1
kon
M-1s-1
pHTemp
°C
Tyrosine-protein kinase SYK
(Homo sapiens (Human))
BDBM302042
(US9598405, 5.1)
Show SMILES C[C@@H]1C[C@](O)(CC[C@@H]1C(O)=O)c1ncc(s1)-c1cc(C)cc(Nc2cc(C)c(F)cn2)n1
Show InChI InChI=1S/C23H25FN4O3S/c1-12-6-17(27-20(7-12)28-19-8-13(2)16(24)10-25-19)18-11-26-22(32-18)23(31)5-4-15(21(29)30)14(3)9-23/h6-8,10-11,14-15,31H,4-5,9H2,1-3H3,(H,29,30)(H,25,27,28)/t14-,15+,23-/m1/s1
NCI pathway
Reactome pathway
US Patent
n/an/a 0.161n/an/an/an/an/an/a
Merck Sharp & Dohme Corp.
US Patent
Assay Description
A recombinant GST-hSYK fusion protein was used to measure potency of compounds to inhibit human Syk activity. The recombinant human GST-SYK (Carna Bi...
US Patent US9598405 (2017)
BindingDB Entry DOI: 10.7270/Q2BR8V7T