BDBM30205 Pyrrolopyridine, 36
SMILES: O=C(NCCc1ccccc1)c1ccc(cc1)-c1cc(ccn1)-c1cc2c(CCNC2=O)[nH]1
InChI Key: InChIKey=MFPLVKCDUSQJLT-UHFFFAOYSA-N
Data: 1 IC50
Activity Spreadsheet -- Enzyme Inhibition Constant Data from BindingDB
Found 1 hit for monomerid = 30205
Trg + Lig
Ki
nM
ΔG°
kcal/mole
IC50
nM
Kd
nM
EC50/IC50
nM
koff
s-1
kon
M-1s-1
pHTemp
°C
MAP kinase-activated protein kinase 2
(Homo sapiens (Human))
BDBM30205
(Pyrrolopyridine, 36)
Show SMILES O=C(NCCc1ccccc1)c1ccc(cc1)-c1cc(ccn1)-c1cc2c(CCNC2=O)[nH]1
Show InChI InChI=1S/C27H24N4O2/c32-26(29-13-10-18-4-2-1-3-5-18)20-8-6-19(7-9-20)24-16-21(11-14-28-24)25-17-22-23(31-25)12-15-30-27(22)33/h1-9,11,14,16-17,31H,10,12-13,15H2,(H,29,32)(H,30,33)
NCI pathway
Reactome pathway
n/an/a 46n/an/an/an/an/an/a
Pfizer
Assay Description
The phosphorylation of HSP27 peptide by MAPKAPK2 was measured using an anion exchange resin capture assay method. The reaction was carried out in rea...
J Med Chem 50: 2647-54 (2007)
Article DOI: 10.1021/jm0611004
BindingDB Entry DOI: 10.7270/Q2794313