BDBM30206 Pyrrolopyridine, 37
SMILES: CN(Cc1ccccc1)C(=O)c1ccc(cc1)-c1cc(ccn1)-c1cc2c(CCNC2=O)[nH]1
InChI Key: InChIKey=UXRPOGJSOJZMFZ-UHFFFAOYSA-N
Data: 1 IC50
Activity Spreadsheet -- Enzyme Inhibition Constant Data from BindingDB
Found 1 hit for monomerid = 30206
Trg + Lig
Ki
nM
ΔG°
kcal/mole
IC50
nM
Kd
nM
EC50/IC50
nM
koff
s-1
kon
M-1s-1
pHTemp
°C
MAP kinase-activated protein kinase 2
(Homo sapiens (Human))
BDBM30206
(Pyrrolopyridine, 37)
Show SMILES CN(Cc1ccccc1)C(=O)c1ccc(cc1)-c1cc(ccn1)-c1cc2c(CCNC2=O)[nH]1
Show InChI InChI=1S/C27H24N4O2/c1-31(17-18-5-3-2-4-6-18)27(33)20-9-7-19(8-10-20)24-15-21(11-13-28-24)25-16-22-23(30-25)12-14-29-26(22)32/h2-11,13,15-16,30H,12,14,17H2,1H3,(H,29,32)
NCI pathway
Reactome pathway
n/an/a 56n/an/an/an/an/an/a
Pfizer
Assay Description
The phosphorylation of HSP27 peptide by MAPKAPK2 was measured using an anion exchange resin capture assay method. The reaction was carried out in rea...
J Med Chem 50: 2647-54 (2007)
Article DOI: 10.1021/jm0611004
BindingDB Entry DOI: 10.7270/Q2794313