null
SMILES: NC(=O)c1c2CN(CCn2nc1-c1cccc(F)c1)C(=O)Nc1cc(ccc1Cl)C(F)(F)F
InChI Key: InChIKey=OYXGIFQCZZUKQV-UHFFFAOYSA-N
Activity Spreadsheet -- Enzyme Inhibition Constant Data from BindingDB
Found 2 hits for monomerid = 302468
Trg + Lig
Ki
nM
ΔG°
kcal/mole
IC50
nM
Kd
nM
EC50/IC50
nM
koff
s-1
kon
M-1s-1
pHTemp
°C
Casein kinase I isoform delta
(Homo sapiens (Human))
BDBM302468
(N5-(2-Chloro-5- (trifluoromethyl)phenyl)- 2-(3-flu...)
Show SMILES NC(=O)c1c2CN(CCn2nc1-c1cccc(F)c1)C(=O)Nc1cc(ccc1Cl)C(F)(F)F
Show InChI InChI=1S/C21H16ClF4N5O2/c22-14-5-4-12(21(24,25)26)9-15(14)28-20(33)30-6-7-31-16(10-30)17(19(27)32)18(29-31)11-2-1-3-13(23)8-11/h1-5,8-9H,6-7,10H2,(H2,27,32)(H,28,33)
US Patent
n/an/a<10n/an/an/an/an/an/a
Bristol-Myers Squibb Company
US Patent
Assay Description
The kinase assay was performed in V-bottom 384-well plates. The final assay volume was 30 μl prepared from 15 μl additions of enzyme, subst...
US Patent US9598423 (2017)
BindingDB Entry DOI: 10.7270/Q2FJ2JT9
Casein kinase I isoform epsilon
(Homo sapiens (Human))
BDBM302468
(N5-(2-Chloro-5- (trifluoromethyl)phenyl)- 2-(3-flu...)
Show SMILES NC(=O)c1c2CN(CCn2nc1-c1cccc(F)c1)C(=O)Nc1cc(ccc1Cl)C(F)(F)F
Show InChI InChI=1S/C21H16ClF4N5O2/c22-14-5-4-12(21(24,25)26)9-15(14)28-20(33)30-6-7-31-16(10-30)17(19(27)32)18(29-31)11-2-1-3-13(23)8-11/h1-5,8-9H,6-7,10H2,(H2,27,32)(H,28,33)
US Patent
n/an/a 55n/an/an/an/an/an/a
Bristol-Myers Squibb Company
US Patent
Assay Description
The kinase assay was performed in V-bottom 384-well plates. The final assay volume was 30 μl prepared from 15 μl additions of enzyme, subst...
US Patent US9598423 (2017)
BindingDB Entry DOI: 10.7270/Q2FJ2JT9