BDBM30268 carboline analog, 80
SMILES: CC1CNC(=O)c2[nH]c3ccc(cc3c12)C(=O)Nc1nc(cs1)C(=O)NCCC(N)=O
InChI Key: InChIKey=RSMIXTOJGKJJLP-UHFFFAOYSA-N
Data: 1 IC50
Activity Spreadsheet -- Enzyme Inhibition Constant Data from BindingDB
Found 1 hit for monomerid = 30268
Trg + Lig
Ki
nM
ΔG°
kcal/mole
IC50
nM
Kd
nM
EC50/IC50
nM
koff
s-1
kon
M-1s-1
pHTemp
°C
MAPK-Activated Protein Kinase 2 (MK2)
(Homo sapiens (Human))
BDBM30268
(carboline analog, 80)
Show SMILES CC1CNC(=O)c2[nH]c3ccc(cc3c12)C(=O)Nc1nc(cs1)C(=O)NCCC(N)=O
Show InChI InChI=1S/C20H20N6O4S/c1-9-7-23-19(30)16-15(9)11-6-10(2-3-12(11)24-16)17(28)26-20-25-13(8-31-20)18(29)22-5-4-14(21)27/h2-3,6,8-9,24H,4-5,7H2,1H3,(H2,21,27)(H,22,29)(H,23,30)(H,25,26,28)
Reactome pathway
n/an/a 21n/an/an/an/an/an/a
Boehringer Ingelheim Pharmaceuticals Inc.
Assay Description
Diluted compounds and activated GST-MK2 were incubated in neutravidin coated plates (Pierce) in reaction buffer containing biotinylated GST-LSP1 and ...
Bioorg Med Chem Lett 17: 4664-9 (2007)
Article DOI: 10.1016/j.bmcl.2007.05.101
BindingDB Entry DOI: 10.7270/Q23N21QP
3D
3D Structure (docked)