BDBM302882 1-(2-((2S,4R)-2-(2'- chloro-2- fluorobiphenyl-3- ylcarbamoyl)-4- fluoropyrrolidin-1-yl)- 2-oxoethyl)-5- (pyridazin-3- ylamino)-1H- indazole-3- carboxamide::US10660876, Cmpd No. 9::US9598446, Compound 9
SMILES: NC(=O)c1nn(CC(=O)N2C[C@H](F)C[C@H]2C(=O)Nc2cccc(c2F)-c2ccccc2Cl)c2ccc(Nc3cccnn3)cc12
InChI Key: InChIKey=IXPCCHVYUPSKBE-NSYGIPOTSA-N
Data: 2 IC50
Activity Spreadsheet -- Enzyme Inhibition Constant Data from BindingDB
Found 2 hits for monomerid = 302882
Trg + Lig
Ki
nM
ΔG°
kcal/mole
IC50
nM
Kd
nM
EC50/IC50
nM
koff
s-1
kon
M-1s-1
pHTemp
°C
Complement factor D
(Homo sapiens (Human))
BDBM302882
(1-(2-((2S,4R)-2-(2'- chloro-2- fluorobiphenyl-3- y...)
Show SMILES NC(=O)c1nn(CC(=O)N2C[C@H](F)C[C@H]2C(=O)Nc2cccc(c2F)-c2ccccc2Cl)c2ccc(Nc3cccnn3)cc12 |r|
Show InChI InChI=1S/C31H25ClF2N8O3/c32-22-7-2-1-5-19(22)20-6-3-8-23(28(20)34)38-31(45)25-13-17(33)15-41(25)27(43)16-42-24-11-10-18(37-26-9-4-12-36-39-26)14-21(24)29(40-42)30(35)44/h1-12,14,17,25H,13,15-16H2,(H2,35,44)(H,37,39)(H,38,45)/t17-,25+/m1/s1
US Patent
n/an/a<1.00E+3n/an/an/an/an/an/a
Achillion Pharmaceuticals, Inc.
US Patent
Assay Description
Human Factor D (purified from human serum, Complement Technology, Inc.) at 80 nM final concentration is incubated with test compound at various conce...
US Patent US10660876 (2020)
Complement factor D
(Homo sapiens (Human))
BDBM302882
(1-(2-((2S,4R)-2-(2'- chloro-2- fluorobiphenyl-3- y...)
Show SMILES NC(=O)c1nn(CC(=O)N2C[C@H](F)C[C@H]2C(=O)Nc2cccc(c2F)-c2ccccc2Cl)c2ccc(Nc3cccnn3)cc12 |r|
Show InChI InChI=1S/C31H25ClF2N8O3/c32-22-7-2-1-5-19(22)20-6-3-8-23(28(20)34)38-31(45)25-13-17(33)15-41(25)27(43)16-42-24-11-10-18(37-26-9-4-12-36-39-26)14-21(24)29(40-42)30(35)44/h1-12,14,17,25H,13,15-16H2,(H2,35,44)(H,37,39)(H,38,45)/t17-,25+/m1/s1
US Patent
n/an/a<1.00E+3n/an/an/an/an/an/a
ACHILLION PHARMACEUTICALS, INC.
US Patent
Assay Description
Human factor D (purified from human serum, Complement Technology, Inc.) at 80 nM final concentration is incubated with test compound at various conce...
US Patent US9598446 (2017)
BindingDB Entry DOI: 10.7270/Q2ST7RWF