null
SMILES: CC(=O)c1cn(CC(=O)N2C[C@H](F)C[C@H]2C(=O)NCc2ccccn2)c2ccc(Nc3cncnc3)cc12
InChI Key: InChIKey=YDUVJFMYAWLJIK-CJAUYULYSA-N
Activity Spreadsheet -- Enzyme Inhibition Constant Data from BindingDB
Found 2 hits for monomerid = 302928
Trg + Lig
Ki
nM
ΔG°
kcal/mole
IC50
nM
Kd
nM
EC50/IC50
nM
koff
s-1
kon
M-1s-1
pHTemp
°C
Complement factor D
(Homo sapiens (Human))
BDBM302928
((2S,4R)-1-(2-(3- acetyl-5-(pyrimidin-5- ylamino)-1...)
Show SMILES CC(=O)c1cn(CC(=O)N2C[C@H](F)C[C@H]2C(=O)NCc2ccccn2)c2ccc(Nc3cncnc3)cc12 |r|
Show InChI InChI=1S/C27H26FN7O3/c1-17(36)23-14-34(24-6-5-19(9-22(23)24)33-21-10-29-16-30-11-21)15-26(37)35-13-18(28)8-25(35)27(38)32-12-20-4-2-3-7-31-20/h2-7,9-11,14,16,18,25,33H,8,12-13,15H2,1H3,(H,32,38)/t18-,25+/m1/s1
US Patent
n/an/a<1.00E+3n/an/an/an/an/an/a
Achillion Pharmaceuticals, Inc.
US Patent
Assay Description
Human Factor D (purified from human serum, Complement Technology, Inc.) at 80 nM final concentration is incubated with test compound at various conce...
US Patent US10660876 (2020)
Complement factor D
(Homo sapiens (Human))
BDBM302928
((2S,4R)-1-(2-(3- acetyl-5-(pyrimidin-5- ylamino)-1...)
Show SMILES CC(=O)c1cn(CC(=O)N2C[C@H](F)C[C@H]2C(=O)NCc2ccccn2)c2ccc(Nc3cncnc3)cc12 |r|
Show InChI InChI=1S/C27H26FN7O3/c1-17(36)23-14-34(24-6-5-19(9-22(23)24)33-21-10-29-16-30-11-21)15-26(37)35-13-18(28)8-25(35)27(38)32-12-20-4-2-3-7-31-20/h2-7,9-11,14,16,18,25,33H,8,12-13,15H2,1H3,(H,32,38)/t18-,25+/m1/s1
US Patent
n/an/a<1.00E+3n/an/an/an/an/an/a
ACHILLION PHARMACEUTICALS, INC.
US Patent
Assay Description
Human factor D (purified from human serum, Complement Technology, Inc.) at 80 nM final concentration is incubated with test compound at various conce...
US Patent US9598446 (2017)
BindingDB Entry DOI: 10.7270/Q2ST7RWF