BDBM302931 (2S,4R)-1-(2-(3- acetyl-5-(pyrimidin-5- ylamino)-1H-indol-1- yl)acetyl)-N-(3- chlorobenzyl)-4- fluoropyrrolidine-2- carboxamide::US10660876, Cmpd No. 19::US9598446, Compound 19
SMILES: CC(=O)c1cn(CC(=O)N2C[C@H](F)C[C@H]2C(=O)NCc2cccc(Cl)c2)c2ccc(Nc3cncnc3)cc12
InChI Key: InChIKey=YYNKXNFVLQYOKI-IBVKSMDESA-N
Data: 2 IC50
Activity Spreadsheet -- Enzyme Inhibition Constant Data from BindingDB
Found 2 hits for monomerid = 302931
Trg + Lig
Ki
nM
ΔG°
kcal/mole
IC50
nM
Kd
nM
EC50/IC50
nM
koff
s-1
kon
M-1s-1
pHTemp
°C
Complement factor D
(Homo sapiens (Human))
BDBM302931
((2S,4R)-1-(2-(3- acetyl-5-(pyrimidin-5- ylamino)-1...)
Show SMILES CC(=O)c1cn(CC(=O)N2C[C@H](F)C[C@H]2C(=O)NCc2cccc(Cl)c2)c2ccc(Nc3cncnc3)cc12 |r|
Show InChI InChI=1S/C28H26ClFN6O3/c1-17(37)24-14-35(25-6-5-21(9-23(24)25)34-22-11-31-16-32-12-22)15-27(38)36-13-20(30)8-26(36)28(39)33-10-18-3-2-4-19(29)7-18/h2-7,9,11-12,14,16,20,26,34H,8,10,13,15H2,1H3,(H,33,39)/t20-,26+/m1/s1
US Patent
n/an/a<1.00E+3n/an/an/an/an/an/a
Achillion Pharmaceuticals, Inc.
US Patent
Assay Description
Human Factor D (purified from human serum, Complement Technology, Inc.) at 80 nM final concentration is incubated with test compound at various conce...
US Patent US10660876 (2020)
Complement factor D
(Homo sapiens (Human))
BDBM302931
((2S,4R)-1-(2-(3- acetyl-5-(pyrimidin-5- ylamino)-1...)
Show SMILES CC(=O)c1cn(CC(=O)N2C[C@H](F)C[C@H]2C(=O)NCc2cccc(Cl)c2)c2ccc(Nc3cncnc3)cc12 |r|
Show InChI InChI=1S/C28H26ClFN6O3/c1-17(37)24-14-35(25-6-5-21(9-23(24)25)34-22-11-31-16-32-12-22)15-27(38)36-13-20(30)8-26(36)28(39)33-10-18-3-2-4-19(29)7-18/h2-7,9,11-12,14,16,20,26,34H,8,10,13,15H2,1H3,(H,33,39)/t20-,26+/m1/s1
US Patent
n/an/a<1.00E+3n/an/an/an/an/an/a
ACHILLION PHARMACEUTICALS, INC.
US Patent
Assay Description
Human factor D (purified from human serum, Complement Technology, Inc.) at 80 nM final concentration is incubated with test compound at various conce...
US Patent US9598446 (2017)
BindingDB Entry DOI: 10.7270/Q2ST7RWF