BDBM303195 US10137122, Compound 68
SMILES: CC1(C)CC(=O)C2=C(C1)Nc1n[nH]c(c1C2(C)c1ccccc1)C(F)(F)F
InChI Key:
Data: 2 IC50  1 Kd
Activity Spreadsheet -- Enzyme Inhibition Constant Data from BindingDB
Found 3 hits for monomerid = 303195
Trg + Lig
Ki
nM
ΔG°
kcal/mole
IC50
nM
Kd
nM
EC50/IC50
nM
koff
s-1
kon
M-1s-1
pHTemp
°C
Glycogen synthase kinase-3
(Homo sapiens (Human))
BDBM303195
(US10137122, Compound 68)
Show SMILES CC1(C)CC(=O)C2=C(C1)Nc1n[nH]c(c1C2(C)c1ccccc1)C(F)(F)F |c:6|
NCI pathway
Reactome pathway
US Patent
n/an/a<100n/an/an/an/an/an/a
The Broad Institute, Inc.; Dana-Farber Cancer Institute, Inc.; The General Hospital Corporation
US Patent
Assay Description
A solution of 4× inhibitor (5 μL), 4× substrate/ATP-Metal solution (5 μL), and 2× Kinase solution (10 μL) was prepared with assay buff...
US Patent US10137122 (2018)
BindingDB Entry DOI: 10.7270/Q2DJ5HPX
Glycogen synthase kinase-3 beta
(Homo sapiens (Human))
BDBM303195
(US10137122, Compound 68)
Show SMILES CC1(C)CC(=O)C2=C(C1)Nc1n[nH]c(c1C2(C)c1ccccc1)C(F)(F)F |c:6|
NCI pathway
Reactome pathway
US Patent
n/an/an/a 2.44E+5n/an/an/an/an/a
The Broad Institute, Inc.; Dana-Farber Cancer Institute, Inc.; The General Hospital Corporation
US Patent
Assay Description
Approximately 20,000 Response Units (RU) of anti GST-antibody (GE Healthcare Life Sciences) were immobilized on Flow Cell (FC) 1 and FC2 of a new, fr...
US Patent US10137122 (2018)
BindingDB Entry DOI: 10.7270/Q2DJ5HPX
Glycogen synthase kinase-3 beta
(Homo sapiens (Human))
BDBM303195
(US10137122, Compound 68)
Show SMILES CC1(C)CC(=O)C2=C(C1)Nc1n[nH]c(c1C2(C)c1ccccc1)C(F)(F)F |c:6|
NCI pathway
Reactome pathway
US Patent
n/an/a<100n/an/an/an/an/an/a
The Broad Institute, Inc.; Dana-Farber Cancer Institute, Inc.; The General Hospital Corporation
US Patent
Assay Description
20 μL/well of 4.7 nM GSK3β and 7 μM peptide in KBA (250 mM HEPES (pH 7.5), 50 mM MgCl2, 5 mM EGTA, 0.05% BRIJ-35) were dispensed onto ...
US Patent US10137122 (2018)
BindingDB Entry DOI: 10.7270/Q2DJ5HPX