BDBM303243 US10137122, Compound 127
SMILES: CC1(C)CC(=O)C2=C(C1)Nc1n[nH]c(C3CC(F)(F)C3)c1[C@]2(C)c1ccccc1
InChI Key:
Data: 1 IC50
Activity Spreadsheet -- Enzyme Inhibition Constant Data from BindingDB
Found 1 hit for monomerid = 303243
Trg + Lig
Ki
nM
ΔG°
kcal/mole
IC50
nM
Kd
nM
EC50/IC50
nM
koff
s-1
kon
M-1s-1
pHTemp
°C
Glycogen synthase kinase-3
(Homo sapiens (Human))
BDBM303243
(US10137122, Compound 127)
Show SMILES CC1(C)CC(=O)C2=C(C1)Nc1n[nH]c(C3CC(F)(F)C3)c1[C@]2(C)c1ccccc1 |r,c:6|
NCI pathway
Reactome pathway
US Patent
n/an/a<100n/an/an/an/an/an/a
The Broad Institute, Inc.; Dana-Farber Cancer Institute, Inc.; The General Hospital Corporation
US Patent
Assay Description
A solution of 4× inhibitor (5 μL), 4× substrate/ATP-Metal solution (5 μL), and 2× Kinase solution (10 μL) was prepared with assay buff...
US Patent US10137122 (2018)
BindingDB Entry DOI: 10.7270/Q2DJ5HPX