BDBM30326 MFA-1
SMILES: C[C@]12CCC3C(CC=C4C=C(CC[C@]34C)C(O)=O)C1CC[C@@H]2C(=O)c1ccc(O)cc1
InChI Key: InChIKey=RPNNXCYIESWDSC-RCFJZYRUSA-N
Data: 1 EC50
PDB links: 1 PDB ID matches this monomer.
Activity Spreadsheet -- Enzyme Inhibition Constant Data from BindingDB
Found 1 hit for monomerid = 30326
Trg + Lig
Ki
nM
ΔG°
kcal/mole
IC50
nM
Kd
nM
EC50/IC50
nM
koff
s-1
kon
M-1s-1
pHTemp
°C
Bile acid receptor
(Homo sapiens (Human))
BDBM30326
(MFA-1)
Show SMILES C[C@]12CCC3C(CC=C4C=C(CC[C@]34C)C(O)=O)C1CC[C@@H]2C(=O)c1ccc(O)cc1 |r,c:9,t:7|
Show InChI InChI=1S/C27H32O4/c1-26-13-11-17(25(30)31)15-18(26)5-8-20-21-9-10-23(27(21,2)14-12-22(20)26)24(29)16-3-6-19(28)7-4-16/h3-7,15,20-23,28H,8-14H2,1-2H3,(H,30,31)/t20?,21?,22?,23-,26+,27+/m1/s1
NCI pathway
Reactome pathway
n/an/an/an/a 16.9n/an/a7.04
Merck Research Laboratories
Assay Description
To each well of a 96-well assay plate, assay buffer was added containing purified GST-FXR, Eu-labeled anti-GST antibody (Perkin-Elmer), streptavidin-...
Proc Natl Acad Sci U S A 105: 5337-42 (2008)
Article DOI: 10.1073/pnas.0710981105
BindingDB Entry DOI: 10.7270/Q2QC01VJ
3D
3D Structure (crystal)