null
SMILES: CC(=O)N1CCC(CC1)N1CCC(CC1)Nc1cncc(c1)-n1cc(cn1)-c1cc(ccc1C)C(=O)NC1CC1
InChI Key: InChIKey=GZGCRIMFKXCJGB-UHFFFAOYSA-N
Activity Spreadsheet -- Enzyme Inhibition Constant Data from BindingDB
Found 1 hit for monomerid = 303430
Trg + Lig
Ki
nM
ΔG°
kcal/mole
IC50
nM
Kd
nM
EC50/IC50
nM
koff
s-1
kon
M-1s-1
pHTemp
°C
Receptor-interacting serine/threonine-protein kinase 2
(Homo sapiens (Human))
BDBM303430
(US10138222, Example 158)
Show SMILES CC(=O)N1CCC(CC1)N1CCC(CC1)Nc1cncc(c1)-n1cc(cn1)-c1cc(ccc1C)C(=O)NC1CC1
Show InChI InChI=1S/C31H39N7O2/c1-21-3-4-23(31(40)35-25-5-6-25)15-30(21)24-17-33-38(20-24)29-16-27(18-32-19-29)34-26-7-11-37(12-8-26)28-9-13-36(14-10-28)22(2)39/h3-4,15-20,25-26,28,34H,5-14H2,1-2H3,(H,35,40)
US Patent
n/an/a 1.20n/an/an/an/an/an/a
Boehringer Ingelheim International GmbH
US Patent
Assay Description
In a 384-well plate, test compound diluted in assay buffer (1% DMSO final) is mixed with 8His-RIPK2 FL enzyme (final concentration of 8 nM). After 15...
US Patent US10138222 (2018)
BindingDB Entry DOI: 10.7270/Q2RV0QS2