null
SMILES: CN1CC[C@@H](Nc2cncc(c2)-n2cc(cn2)-c2cc(C(=O)NC3CC3)c(F)cc2C)C(F)(F)C1
InChI Key: InChIKey=UNLSTYDFJIXJDP-HSZRJFAPSA-N
Activity Spreadsheet -- Enzyme Inhibition Constant Data from BindingDB
Found 1 hit for monomerid = 303448
Trg + Lig
Ki
nM
ΔG°
kcal/mole
IC50
nM
Kd
nM
EC50/IC50
nM
koff
s-1
kon
M-1s-1
pHTemp
°C
Receptor-interacting serine/threonine-protein kinase 2
(Homo sapiens (Human))
BDBM303448
(US10138222, Example 176)
Show SMILES CN1CC[C@@H](Nc2cncc(c2)-n2cc(cn2)-c2cc(C(=O)NC3CC3)c(F)cc2C)C(F)(F)C1 |r|
Show InChI InChI=1S/C25H27F3N6O/c1-15-7-22(26)21(24(35)32-17-3-4-17)9-20(15)16-10-30-34(13-16)19-8-18(11-29-12-19)31-23-5-6-33(2)14-25(23,27)28/h7-13,17,23,31H,3-6,14H2,1-2H3,(H,32,35)/t23-/m1/s1
US Patent
n/an/a 1.5n/an/an/an/an/an/a
Boehringer Ingelheim International GmbH
US Patent
Assay Description
In a 384-well plate, test compound diluted in assay buffer (1% DMSO final) is mixed with 8His-RIPK2 FL enzyme (final concentration of 8 nM). After 15...
US Patent US10138222 (2018)
BindingDB Entry DOI: 10.7270/Q2RV0QS2