BDBM303569 US10138229, Example 81::US10875852, Example 81
SMILES: NC(=O)c1c(N)n(nc1-c1ccc(Oc2ccccc2)cc1)[C@H]1C[C@@]2(C1)CCN(C2)C(=O)C=C
InChI Key: InChIKey=GSESPIMMRSEZAO-SKUGRUHMSA-N
Data: 2 IC50
Activity Spreadsheet -- Enzyme Inhibition Constant Data from BindingDB
Found 2 hits for monomerid = 303569
Trg + Lig
Ki
nM
ΔG°
kcal/mole
IC50
nM
Kd
nM
EC50/IC50
nM
koff
s-1
kon
M-1s-1
pHTemp
°C
Tyrosine-protein kinase BTK
(Homo sapiens (Human))
BDBM303569
(US10138229, Example 81 | US10875852, Example 81)
Show SMILES NC(=O)c1c(N)n(nc1-c1ccc(Oc2ccccc2)cc1)[C@H]1C[C@@]2(C1)CCN(C2)C(=O)C=C |r,wU:22.24,24.33,wD:24.29,(-4.39,2.74,;-4.39,1.2,;-5.73,.43,;-3.06,.43,;-3.06,-1.11,;-4.39,-1.88,;-1.6,-1.59,;-.69,-.34,;-1.6,.9,;-1.2,2.39,;.29,2.79,;.69,4.28,;-.4,5.36,;-0,6.85,;1.49,7.25,;2.57,6.16,;4.06,6.56,;4.46,8.05,;3.37,9.14,;1.88,8.74,;-1.89,4.97,;-2.29,3.48,;-.83,-2.92,;.66,-3.32,;.26,-4.81,;-1.22,-4.41,;-.64,-6.06,;.26,-7.3,;1.73,-6.83,;1.73,-5.29,;3.06,-7.6,;3.06,-9.14,;4.39,-6.83,;5.73,-7.6,)|
Show InChI InChI=1S/C26H27N5O3/c1-2-21(32)30-13-12-26(16-30)14-18(15-26)31-24(27)22(25(28)33)23(29-31)17-8-10-20(11-9-17)34-19-6-4-3-5-7-19/h2-11,18H,1,12-16,27H2,(H2,28,33)/t18-,26+
NCI pathway
Reactome pathway
US Patent
n/an/a 0.790n/an/an/an/an/an/a
Boehringer Ingelheim International GmbH
US Patent
Assay Description
An HTRF assay (Cisbio KinEASE-TK cat #62TK0PEC) was performed to quantitate the ability of test compounds to inhibit BTK mediated phosphorylation of ...
US Patent US10875852 (2020)
Tyrosine-protein kinase BTK
(Homo sapiens (Human))
BDBM303569
(US10138229, Example 81 | US10875852, Example 81)
Show SMILES NC(=O)c1c(N)n(nc1-c1ccc(Oc2ccccc2)cc1)[C@H]1C[C@@]2(C1)CCN(C2)C(=O)C=C |r,wU:22.24,24.33,wD:24.29,(-4.39,2.74,;-4.39,1.2,;-5.73,.43,;-3.06,.43,;-3.06,-1.11,;-4.39,-1.88,;-1.6,-1.59,;-.69,-.34,;-1.6,.9,;-1.2,2.39,;.29,2.79,;.69,4.28,;-.4,5.36,;-0,6.85,;1.49,7.25,;2.57,6.16,;4.06,6.56,;4.46,8.05,;3.37,9.14,;1.88,8.74,;-1.89,4.97,;-2.29,3.48,;-.83,-2.92,;.66,-3.32,;.26,-4.81,;-1.22,-4.41,;-.64,-6.06,;.26,-7.3,;1.73,-6.83,;1.73,-5.29,;3.06,-7.6,;3.06,-9.14,;4.39,-6.83,;5.73,-7.6,)|
Show InChI InChI=1S/C26H27N5O3/c1-2-21(32)30-13-12-26(16-30)14-18(15-26)31-24(27)22(25(28)33)23(29-31)17-8-10-20(11-9-17)34-19-6-4-3-5-7-19/h2-11,18H,1,12-16,27H2,(H2,28,33)/t18-,26+
NCI pathway
Reactome pathway
US Patent
n/an/a 0.790n/an/an/an/an/an/a
Boehringer Ingelheim International GmbH
US Patent
Assay Description
TBDAn HTRF assay (Cisbio KinEASE-TK cat #62TKOPEC) was performed to quantitate the ability of test compounds to inhibit BTK mediated phosphorylation ...
US Patent US10138229 (2018)
BindingDB Entry DOI: 10.7270/Q2CJ8GJJ