BDBM303570 US10138229, Example 82::US10875852, Example 82
SMILES: NC(=O)c1c(N)n(nc1-c1ccc(Oc2ccccc2)cc1)C1CC2(C1)CCN(CC2)C(=O)C=C
InChI Key: InChIKey=QKDVFJURLZLUFH-UHFFFAOYSA-N
Data: 2 IC50
Activity Spreadsheet -- Enzyme Inhibition Constant Data from BindingDB
Found 2 hits for monomerid = 303570
Trg + Lig
Ki
nM
ΔG°
kcal/mole
IC50
nM
Kd
nM
EC50/IC50
nM
koff
s-1
kon
M-1s-1
pHTemp
°C
Tyrosine-protein kinase BTK
(Homo sapiens (Human))
BDBM303570
(US10138229, Example 82 | US10875852, Example 82)
Show SMILES NC(=O)c1c(N)n(nc1-c1ccc(Oc2ccccc2)cc1)C1CC2(C1)CCN(CC2)C(=O)C=C
Show InChI InChI=1S/C27H29N5O3/c1-2-22(33)31-14-12-27(13-15-31)16-19(17-27)32-25(28)23(26(29)34)24(30-32)18-8-10-21(11-9-18)35-20-6-4-3-5-7-20/h2-11,19H,1,12-17,28H2,(H2,29,34)
NCI pathway
Reactome pathway
US Patent
n/an/a 2n/an/an/an/an/an/a
Boehringer Ingelheim International GmbH
US Patent
Assay Description
An HTRF assay (Cisbio KinEASE-TK cat #62TK0PEC) was performed to quantitate the ability of test compounds to inhibit BTK mediated phosphorylation of ...
US Patent US10875852 (2020)
Tyrosine-protein kinase BTK
(Homo sapiens (Human))
BDBM303570
(US10138229, Example 82 | US10875852, Example 82)
Show SMILES NC(=O)c1c(N)n(nc1-c1ccc(Oc2ccccc2)cc1)C1CC2(C1)CCN(CC2)C(=O)C=C
Show InChI InChI=1S/C27H29N5O3/c1-2-22(33)31-14-12-27(13-15-31)16-19(17-27)32-25(28)23(26(29)34)24(30-32)18-8-10-21(11-9-18)35-20-6-4-3-5-7-20/h2-11,19H,1,12-17,28H2,(H2,29,34)
NCI pathway
Reactome pathway
US Patent
n/an/a 2n/an/an/an/an/an/a
Boehringer Ingelheim International GmbH
US Patent
Assay Description
TBDAn HTRF assay (Cisbio KinEASE-TK cat #62TKOPEC) was performed to quantitate the ability of test compounds to inhibit BTK mediated phosphorylation ...
US Patent US10138229 (2018)
BindingDB Entry DOI: 10.7270/Q2CJ8GJJ