null
SMILES: CC#CC(=O)N1CCC2(CC(C2)n2nc(c(C(N)=O)c2N)-c2ccc(Oc3ccccc3)cc2)CC1
InChI Key: InChIKey=DTNZWLUSVDQGNA-UHFFFAOYSA-N
Activity Spreadsheet -- Enzyme Inhibition Constant Data from BindingDB
Found 2 hits for monomerid = 303571
Trg + Lig
Ki
nM
ΔG°
kcal/mole
IC50
nM
Kd
nM
EC50/IC50
nM
koff
s-1
kon
M-1s-1
pHTemp
°C
Tyrosine-protein kinase BTK
(Homo sapiens (Human))
BDBM303571
(US10138229, Example 83 | US10875852, Example 83)
Show SMILES CC#CC(=O)N1CCC2(CC(C2)n2nc(c(C(N)=O)c2N)-c2ccc(Oc3ccccc3)cc2)CC1
Show InChI InChI=1S/C28H29N5O3/c1-2-6-23(34)32-15-13-28(14-16-32)17-20(18-28)33-26(29)24(27(30)35)25(31-33)19-9-11-22(12-10-19)36-21-7-4-3-5-8-21/h3-5,7-12,20H,13-18,29H2,1H3,(H2,30,35)
NCI pathway
Reactome pathway
US Patent
n/an/a 2.10n/an/an/an/an/an/a
Boehringer Ingelheim International GmbH
US Patent
Assay Description
An HTRF assay (Cisbio KinEASE-TK cat #62TK0PEC) was performed to quantitate the ability of test compounds to inhibit BTK mediated phosphorylation of ...
US Patent US10875852 (2020)
BindingDB Entry DOI: 10.7270/Q2DN484H
Tyrosine-protein kinase BTK
(Homo sapiens (Human))
BDBM303571
(US10138229, Example 83 | US10875852, Example 83)
Show SMILES CC#CC(=O)N1CCC2(CC(C2)n2nc(c(C(N)=O)c2N)-c2ccc(Oc3ccccc3)cc2)CC1
Show InChI InChI=1S/C28H29N5O3/c1-2-6-23(34)32-15-13-28(14-16-32)17-20(18-28)33-26(29)24(27(30)35)25(31-33)19-9-11-22(12-10-19)36-21-7-4-3-5-8-21/h3-5,7-12,20H,13-18,29H2,1H3,(H2,30,35)
NCI pathway
Reactome pathway
US Patent
n/an/a 2.10n/an/an/an/an/an/a
Boehringer Ingelheim International GmbH
US Patent
Assay Description
TBDAn HTRF assay (Cisbio KinEASE-TK cat #62TKOPEC) was performed to quantitate the ability of test compounds to inhibit BTK mediated phosphorylation ...
US Patent US10138229 (2018)
BindingDB Entry DOI: 10.7270/Q2CJ8GJJ