BDBM303605 BDBM303608::US10138229, Example 117::US10875852, Example 120
SMILES: NC(=O)c1c(N)n(nc1-c1ccc(Oc2ccccc2)cn1)[C@H]1C[C@@]2(C1)CCN(C2)C(=O)C=C
InChI Key: InChIKey=GNJIPSHHOHJBNX-NDQYQSCMSA-N
Data: 4 IC50
Activity Spreadsheet -- Enzyme Inhibition Constant Data from BindingDB
Found 4 hits for monomerid = 303605
Trg + Lig
Ki
nM
ΔG°
kcal/mole
IC50
nM
Kd
nM
EC50/IC50
nM
koff
s-1
kon
M-1s-1
pHTemp
°C
Tyrosine-protein kinase BTK
(Homo sapiens (Human))
BDBM303605
(BDBM303608 | US10138229, Example 117 | US10875852,...)
Show SMILES NC(=O)c1c(N)n(nc1-c1ccc(Oc2ccccc2)cn1)[C@H]1C[C@@]2(C1)CCN(C2)C(=O)C=C |r,wU:22.24,24.33,wD:24.29,(-4.39,2.74,;-4.39,1.2,;-5.73,.43,;-3.06,.43,;-3.06,-1.11,;-4.39,-1.88,;-1.6,-1.59,;-.69,-.34,;-1.6,.9,;-1.2,2.39,;-2.29,3.48,;-1.89,4.97,;-.4,5.36,;-0,6.85,;1.49,7.25,;2.57,6.16,;4.06,6.56,;4.46,8.05,;3.37,9.14,;1.88,8.74,;.69,4.28,;.29,2.79,;-.83,-2.92,;.66,-3.32,;.26,-4.81,;-1.22,-4.41,;-.64,-6.06,;.26,-7.3,;1.73,-6.83,;1.73,-5.29,;3.06,-7.6,;3.06,-9.14,;4.39,-6.83,;5.73,-7.6,)|
Show InChI InChI=1S/C25H26N6O3/c1-2-20(32)30-11-10-25(15-30)12-16(13-25)31-23(26)21(24(27)33)22(29-31)19-9-8-18(14-28-19)34-17-6-4-3-5-7-17/h2-9,14,16H,1,10-13,15,26H2,(H2,27,33)/t16-,25+
NCI pathway
Reactome pathway
US Patent
n/an/a 1.10n/an/an/an/an/an/a
Boehringer Ingelheim International GmbH
US Patent
Assay Description
TBDAn HTRF assay (Cisbio KinEASE-TK cat #62TKOPEC) was performed to quantitate the ability of test compounds to inhibit BTK mediated phosphorylation ...
US Patent US10138229 (2018)
BindingDB Entry DOI: 10.7270/Q2CJ8GJJ
Tyrosine-protein kinase BTK
(Homo sapiens (Human))
BDBM303605
(BDBM303608 | US10138229, Example 117 | US10875852,...)
Show SMILES NC(=O)c1c(N)n(nc1-c1ccc(Oc2ccccc2)cn1)[C@H]1C[C@@]2(C1)CCN(C2)C(=O)C=C |r,wU:22.24,24.33,wD:24.29,(-4.39,2.74,;-4.39,1.2,;-5.73,.43,;-3.06,.43,;-3.06,-1.11,;-4.39,-1.88,;-1.6,-1.59,;-.69,-.34,;-1.6,.9,;-1.2,2.39,;-2.29,3.48,;-1.89,4.97,;-.4,5.36,;-0,6.85,;1.49,7.25,;2.57,6.16,;4.06,6.56,;4.46,8.05,;3.37,9.14,;1.88,8.74,;.69,4.28,;.29,2.79,;-.83,-2.92,;.66,-3.32,;.26,-4.81,;-1.22,-4.41,;-.64,-6.06,;.26,-7.3,;1.73,-6.83,;1.73,-5.29,;3.06,-7.6,;3.06,-9.14,;4.39,-6.83,;5.73,-7.6,)|
Show InChI InChI=1S/C25H26N6O3/c1-2-20(32)30-11-10-25(15-30)12-16(13-25)31-23(26)21(24(27)33)22(29-31)19-9-8-18(14-28-19)34-17-6-4-3-5-7-17/h2-9,14,16H,1,10-13,15,26H2,(H2,27,33)/t16-,25+
NCI pathway
Reactome pathway
US Patent
n/an/a 3.5n/an/an/an/an/an/a
Boehringer Ingelheim International GmbH
US Patent
Assay Description
An HTRF assay (Cisbio KinEASE-TK cat #62TK0PEC) was performed to quantitate the ability of test compounds to inhibit BTK mediated phosphorylation of ...
US Patent US10875852 (2020)
Tyrosine-protein kinase BTK
(Homo sapiens (Human))
BDBM303605
(BDBM303608 | US10138229, Example 117 | US10875852,...)
Show SMILES NC(=O)c1c(N)n(nc1-c1ccc(Oc2ccccc2)cn1)[C@H]1C[C@@]2(C1)CCN(C2)C(=O)C=C |r,wU:22.24,24.33,wD:24.29,(-4.39,2.74,;-4.39,1.2,;-5.73,.43,;-3.06,.43,;-3.06,-1.11,;-4.39,-1.88,;-1.6,-1.59,;-.69,-.34,;-1.6,.9,;-1.2,2.39,;-2.29,3.48,;-1.89,4.97,;-.4,5.36,;-0,6.85,;1.49,7.25,;2.57,6.16,;4.06,6.56,;4.46,8.05,;3.37,9.14,;1.88,8.74,;.69,4.28,;.29,2.79,;-.83,-2.92,;.66,-3.32,;.26,-4.81,;-1.22,-4.41,;-.64,-6.06,;.26,-7.3,;1.73,-6.83,;1.73,-5.29,;3.06,-7.6,;3.06,-9.14,;4.39,-6.83,;5.73,-7.6,)|
Show InChI InChI=1S/C25H26N6O3/c1-2-20(32)30-11-10-25(15-30)12-16(13-25)31-23(26)21(24(27)33)22(29-31)19-9-8-18(14-28-19)34-17-6-4-3-5-7-17/h2-9,14,16H,1,10-13,15,26H2,(H2,27,33)/t16-,25+
NCI pathway
Reactome pathway
US Patent
n/an/a 1.10n/an/an/an/an/an/a
Boehringer Ingelheim International GmbH
US Patent
Assay Description
An HTRF assay (Cisbio KinEASE-TK cat #62TK0PEC) was performed to quantitate the ability of test compounds to inhibit BTK mediated phosphorylation of ...
US Patent US10875852 (2020)
Tyrosine-protein kinase BTK
(Homo sapiens (Human))
BDBM303605
(BDBM303608 | US10138229, Example 117 | US10875852,...)
Show SMILES NC(=O)c1c(N)n(nc1-c1ccc(Oc2ccccc2)cn1)[C@H]1C[C@@]2(C1)CCN(C2)C(=O)C=C |r,wU:22.24,24.33,wD:24.29,(-4.39,2.74,;-4.39,1.2,;-5.73,.43,;-3.06,.43,;-3.06,-1.11,;-4.39,-1.88,;-1.6,-1.59,;-.69,-.34,;-1.6,.9,;-1.2,2.39,;-2.29,3.48,;-1.89,4.97,;-.4,5.36,;-0,6.85,;1.49,7.25,;2.57,6.16,;4.06,6.56,;4.46,8.05,;3.37,9.14,;1.88,8.74,;.69,4.28,;.29,2.79,;-.83,-2.92,;.66,-3.32,;.26,-4.81,;-1.22,-4.41,;-.64,-6.06,;.26,-7.3,;1.73,-6.83,;1.73,-5.29,;3.06,-7.6,;3.06,-9.14,;4.39,-6.83,;5.73,-7.6,)|
Show InChI InChI=1S/C25H26N6O3/c1-2-20(32)30-11-10-25(15-30)12-16(13-25)31-23(26)21(24(27)33)22(29-31)19-9-8-18(14-28-19)34-17-6-4-3-5-7-17/h2-9,14,16H,1,10-13,15,26H2,(H2,27,33)/t16-,25+
NCI pathway
Reactome pathway
US Patent
n/an/a 3.5n/an/an/an/an/an/a
Boehringer Ingelheim International GmbH
US Patent
Assay Description
TBDAn HTRF assay (Cisbio KinEASE-TK cat #62TKOPEC) was performed to quantitate the ability of test compounds to inhibit BTK mediated phosphorylation ...
US Patent US10138229 (2018)
BindingDB Entry DOI: 10.7270/Q2CJ8GJJ