BDBM30368 piperidinyl glycine derivative, 24e
SMILES: CC(C)OC(=O)N1CCC(CC1)[C@@H](NS(=O)(=O)c1ccc(s1)-c1ccc(OC(F)(F)F)cc1)C(O)=O
InChI Key: InChIKey=CLWZJBNUWLJFOR-LJQANCHMSA-N
Data: 1 IC50
Activity Spreadsheet -- Enzyme Inhibition Constant Data from BindingDB
Found 1 hit for monomerid = 30368
Trg + Lig
Ki
nM
ΔG°
kcal/mole
IC50
nM
Kd
nM
EC50/IC50
nM
koff
s-1
kon
M-1s-1
pHTemp
°C
Collagenase 3
(Homo sapiens (Human))
BDBM30368
(piperidinyl glycine derivative, 24e)
Show SMILES CC(C)OC(=O)N1CCC(CC1)[C@@H](NS(=O)(=O)c1ccc(s1)-c1ccc(OC(F)(F)F)cc1)C(O)=O |r|
Show InChI InChI=1S/C22H25F3N2O7S2/c1-13(2)33-21(30)27-11-9-15(10-12-27)19(20(28)29)26-36(31,32)18-8-7-17(35-18)14-3-5-16(6-4-14)34-22(23,24)25/h3-8,13,15,19,26H,9-12H2,1-2H3,(H,28,29)/t19-/m1/s1
NCI pathway
Reactome pathway
n/an/a 2.20n/an/an/an/a7.522
Novartis
Assay Description
Test compounds were serially diluted in the assay buffer. In each well of a 96-well microtiter plate (Immunofluor B, Dynatech), the inhibitor solutio...
J Med Chem 52: 3523-38 (2009)
Article DOI: 10.1021/jm801394m
BindingDB Entry DOI: 10.7270/Q2B27SN3