BDBM30369 piperidinyl glycine derivative, 24f
SMILES: CCOc1ccc(cc1)-c1ccc(s1)S(=O)(=O)N[C@H](C1CCN(CC1)C(=O)OC(C)C)C(O)=O
InChI Key: InChIKey=GYETWAWIKBOMPE-OAQYLSRUSA-N
Data: 1 KI  4 IC50
PDB links: 1 PDB ID matches this monomer.
Activity Spreadsheet -- Enzyme Inhibition Constant Data from BindingDB
Found 4 hits for monomerid = 30369
Trg + Lig
Ki
nM
ΔG°
kcal/mole
IC50
nM
Kd
nM
EC50/IC50
nM
koff
s-1
kon
M-1s-1
pHTemp
°C
Collagenase 3
(Homo sapiens (Human))
BDBM30369
(piperidinyl glycine derivative, 24f)
Show SMILES CCOc1ccc(cc1)-c1ccc(s1)S(=O)(=O)N[C@H](C1CCN(CC1)C(=O)OC(C)C)C(O)=O |r|
Show InChI InChI=1S/C23H30N2O7S2/c1-4-31-18-7-5-16(6-8-18)19-9-10-20(33-19)34(29,30)24-21(22(26)27)17-11-13-25(14-12-17)23(28)32-15(2)3/h5-10,15,17,21,24H,4,11-14H2,1-3H3,(H,26,27)/t21-/m1/s1
NCI pathway
Reactome pathway
0.190 -13.1 0.5n/an/an/an/a7.522
Novartis
Assay Description
Test compounds were serially diluted in the assay buffer. In each well of a 96-well microtiter plate (Immunofluor B, Dynatech), the inhibitor solutio...
J Med Chem 52: 3523-38 (2009)
Article DOI: 10.1021/jm801394m
BindingDB Entry DOI: 10.7270/Q2B27SN3
3D
3D Structure (crystal)
Stromelysin-1
(Homo sapiens (Human))
BDBM30369
(piperidinyl glycine derivative, 24f)
Show SMILES CCOc1ccc(cc1)-c1ccc(s1)S(=O)(=O)N[C@H](C1CCN(CC1)C(=O)OC(C)C)C(O)=O |r|
Show InChI InChI=1S/C23H30N2O7S2/c1-4-31-18-7-5-16(6-8-18)19-9-10-20(33-19)34(29,30)24-21(22(26)27)17-11-13-25(14-12-17)23(28)32-15(2)3/h5-10,15,17,21,24H,4,11-14H2,1-3H3,(H,26,27)/t21-/m1/s1
Reactome pathway
n/an/a 18n/an/an/an/an/a25
Novartis
Assay Description
Test compounds were serially diluted in deep well plates, and an aliquot of the inhibitor solutions was transferred to a Biomek deep well plate conta...
J Med Chem 52: 3523-38 (2009)
Article DOI: 10.1021/jm801394m
BindingDB Entry DOI: 10.7270/Q2B27SN3
Matrix metalloproteinase-9
(Homo sapiens (Human))
BDBM30369
(piperidinyl glycine derivative, 24f)
Show SMILES CCOc1ccc(cc1)-c1ccc(s1)S(=O)(=O)N[C@H](C1CCN(CC1)C(=O)OC(C)C)C(O)=O |r|
Show InChI InChI=1S/C23H30N2O7S2/c1-4-31-18-7-5-16(6-8-18)19-9-10-20(33-19)34(29,30)24-21(22(26)27)17-11-13-25(14-12-17)23(28)32-15(2)3/h5-10,15,17,21,24H,4,11-14H2,1-3H3,(H,26,27)/t21-/m1/s1
Reactome pathway
n/an/a 10n/an/an/an/an/a25
Novartis
Assay Description
Test compounds were serially diluted in deep well plates, and an aliquot of the inhibitor solutions was transferred to a Biomek deep well plate conta...
J Med Chem 52: 3523-38 (2009)
Article DOI: 10.1021/jm801394m
BindingDB Entry DOI: 10.7270/Q2B27SN3
Interstitial collagenase
(Homo sapiens (Human))
BDBM30369
(piperidinyl glycine derivative, 24f)
Show SMILES CCOc1ccc(cc1)-c1ccc(s1)S(=O)(=O)N[C@H](C1CCN(CC1)C(=O)OC(C)C)C(O)=O |r|
Show InChI InChI=1S/C23H30N2O7S2/c1-4-31-18-7-5-16(6-8-18)19-9-10-20(33-19)34(29,30)24-21(22(26)27)17-11-13-25(14-12-17)23(28)32-15(2)3/h5-10,15,17,21,24H,4,11-14H2,1-3H3,(H,26,27)/t21-/m1/s1
Reactome pathway
n/an/a>1.00E+4n/an/an/an/an/a25
Novartis
Assay Description
Test compounds were serially diluted in deep well plates, and an aliquot of the inhibitor solutions was transferred to a Biomek deep well plate conta...
J Med Chem 52: 3523-38 (2009)
Article DOI: 10.1021/jm801394m
BindingDB Entry DOI: 10.7270/Q2B27SN3