BDBM30377 piperidinyl glycine derivative, 24n
SMILES: CCCOC(=O)N1CCC(CC1)[C@@H](NS(=O)(=O)c1ccc(s1)-c1ccc(OCC)cc1)C(O)=O
InChI Key: InChIKey=IGDBRYFDPWPBAI-OAQYLSRUSA-N
Data: 2 IC50
Activity Spreadsheet -- Enzyme Inhibition Constant Data from BindingDB
Found 2 hits for monomerid = 30377
Trg + Lig
Ki
nM
ΔG°
kcal/mole
IC50
nM
Kd
nM
EC50/IC50
nM
koff
s-1
kon
M-1s-1
pHTemp
°C
Interstitial collagenase
(Homo sapiens (Human))
BDBM30377
(piperidinyl glycine derivative, 24n)
Show SMILES CCCOC(=O)N1CCC(CC1)[C@@H](NS(=O)(=O)c1ccc(s1)-c1ccc(OCC)cc1)C(O)=O |r|
Show InChI InChI=1S/C23H30N2O7S2/c1-3-15-32-23(28)25-13-11-17(12-14-25)21(22(26)27)24-34(29,30)20-10-9-19(33-20)16-5-7-18(8-6-16)31-4-2/h5-10,17,21,24H,3-4,11-15H2,1-2H3,(H,26,27)/t21-/m1/s1
Reactome pathway
n/an/a 9.33E+3n/an/an/an/an/a25
Novartis
Assay Description
Test compounds were serially diluted in deep well plates, and an aliquot of the inhibitor solutions was transferred to a Biomek deep well plate conta...
J Med Chem 52: 3523-38 (2009)
Article DOI: 10.1021/jm801394m
BindingDB Entry DOI: 10.7270/Q2B27SN3
Collagenase 3
(Homo sapiens (Human))
BDBM30377
(piperidinyl glycine derivative, 24n)
Show SMILES CCCOC(=O)N1CCC(CC1)[C@@H](NS(=O)(=O)c1ccc(s1)-c1ccc(OCC)cc1)C(O)=O |r|
Show InChI InChI=1S/C23H30N2O7S2/c1-3-15-32-23(28)25-13-11-17(12-14-25)21(22(26)27)24-34(29,30)20-10-9-19(33-20)16-5-7-18(8-6-16)31-4-2/h5-10,17,21,24H,3-4,11-15H2,1-2H3,(H,26,27)/t21-/m1/s1
NCI pathway
Reactome pathway
n/an/a 1n/an/an/an/an/a25
Novartis
Assay Description
Test compounds were serially diluted in the assay buffer. In each well of a 96-well microtiter plate (Immunofluor B, Dynatech), the inhibitor solutio...
J Med Chem 52: 3523-38 (2009)
Article DOI: 10.1021/jm801394m
BindingDB Entry DOI: 10.7270/Q2B27SN3