BDBM30395 piperidinyl glycine derivative, 27b
SMILES: COc1ccc(cc1)-c1ccc(s1)S(=O)(=O)N[C@H](C1CCN(CC1)S(=O)(=O)c1ccccc1)C(O)=O
InChI Key: InChIKey=SNWCXQPNOQQJPW-HSZRJFAPSA-N
Data: 2 IC50
Activity Spreadsheet -- Enzyme Inhibition Constant Data from BindingDB
Found 2 hits for monomerid = 30395
Trg + Lig
Ki
nM
ΔG°
kcal/mole
IC50
nM
Kd
nM
EC50/IC50
nM
koff
s-1
kon
M-1s-1
pHTemp
°C
Interstitial collagenase
(Homo sapiens (Human))
BDBM30395
(piperidinyl glycine derivative, 27b)
Show SMILES COc1ccc(cc1)-c1ccc(s1)S(=O)(=O)N[C@H](C1CCN(CC1)S(=O)(=O)c1ccccc1)C(O)=O |r|
Show InChI InChI=1S/C24H26N2O7S3/c1-33-19-9-7-17(8-10-19)21-11-12-22(34-21)35(29,30)25-23(24(27)28)18-13-15-26(16-14-18)36(31,32)20-5-3-2-4-6-20/h2-12,18,23,25H,13-16H2,1H3,(H,27,28)/t23-/m1/s1
Reactome pathway
n/an/a 650n/an/an/an/an/a25
Novartis
Assay Description
Test compounds were serially diluted in deep well plates, and an aliquot of the inhibitor solutions was transferred to a Biomek deep well plate conta...
J Med Chem 52: 3523-38 (2009)
Article DOI: 10.1021/jm801394m
BindingDB Entry DOI: 10.7270/Q2B27SN3
Collagenase 3
(Homo sapiens (Human))
BDBM30395
(piperidinyl glycine derivative, 27b)
Show SMILES COc1ccc(cc1)-c1ccc(s1)S(=O)(=O)N[C@H](C1CCN(CC1)S(=O)(=O)c1ccccc1)C(O)=O |r|
Show InChI InChI=1S/C24H26N2O7S3/c1-33-19-9-7-17(8-10-19)21-11-12-22(34-21)35(29,30)25-23(24(27)28)18-13-15-26(16-14-18)36(31,32)20-5-3-2-4-6-20/h2-12,18,23,25H,13-16H2,1H3,(H,27,28)/t23-/m1/s1
NCI pathway
Reactome pathway
n/an/a 1.20n/an/an/an/an/a25
Novartis
Assay Description
Test compounds were serially diluted in the assay buffer. In each well of a 96-well microtiter plate (Immunofluor B, Dynatech), the inhibitor solutio...
J Med Chem 52: 3523-38 (2009)
Article DOI: 10.1021/jm801394m
BindingDB Entry DOI: 10.7270/Q2B27SN3